{"text_format":"1","workbook":"xlsx","n_sheets":13,"sheets":["Hinweise - bitte beachten!!!","Dateneingabe","Statistik","Richterblatt","Richterblatt Gruppe","Liste Beginner","Liste Klasse 1","Liste Klasse 2","Liste Klasse 3","Liste Klasse S","Übersicht Übungen","Chip-Kontrolle","Gesamtergebnisliste"],"not_rendered":{"charts":0,"images":0,"macros":1,"external_links":0,"defined_names":20,"comments":1,"pivot_tables":0},"unopened":[],"bounds":{"document_bytes":16777216,"sheet_cells":100000,"rows_first":2000,"rows_last":500,"rows_between":2000,"halvings":0,"cell_chars":16384,"cell_head_chars":4096},"cells_cut":0,"cells_raw":0,"read":"whole","date_system":"1900"}

{"sheet":"Hinweise - bitte beachten!!!","index":0,"n_rows":14,"n_cols":1,"rows_kept":14,"cut":false,"hidden":false,"merged":[]}
["HSVRM Obedience Auswertung - Version 2019 v5.1"]
["erstellt von Sören Marquardt für den Hundesportverband Rhein-Main (HSVRM)"]
[]
["Liebe Hundesportler!"]
[]
["Bitte beachtet die Datei mit den WICHTIGEN Hinweisen!!!"]
[]
["Die Datei steht auf der Internet-Seite des HSVRM (www.hsvrm.de) zum Herunterladen im PDF-Format zur Verfügung! "]
["Ihr benötigt ein entsprechendes Leseprogramm (z. B. der Adobe Reader - kostenlos)! "]
["Bevor Ihr Euch mit der Excel-Auswertungs-Datei befasst, solltet Ihr die Datei mit den Hinweisen in Ruhe durchgelesen haben! "]
[]
["Das Erstellen dieser Excel-Auswertungs-Datei hat Zeit und Mühe gekostet und ich bitte Euch, diese Datei nicht zu „knacken“ und meinen Autorenvermerk auf jedem Blatt nicht zu löschen.\nBei Rückfragen, Anregungen und Lob :) schickt mir bitte eine E-Mail an S.Marquardt@hsvrm.de!"]
[]
["Änderungen an dieser Datei sind nur durch mich oder unter Abstimmung mit mir gestattet. "]

{"sheet":"Dateneingabe","index":1,"n_rows":109,"n_cols":16,"rows_kept":109,"cut":false,"hidden":false,"merged":[[89,0,89,5],[7,13,7,14],[7,2,7,6],[6,0,6,1],[6,13,6,14],[6,2,6,6],[69,0,69,5],[9,0,9,5],[29,0,29,5],[49,0,49,5],[7,0,7,1],[4,2,4,6],[5,2,5,6],[0,0,0,15],[1,0,1,15],[3,4,3,6],[3,0,3,3],[4,0,4,1],[5,0,5,1],[4,13,4,14],[5,13,5,14],[3,8,3,12],[3,13,3,14]]}
[{"$f":"'Hinweise - bitte beachten!!!'!A1:A1","v":"HSVRM Obedience Auswertung - Version 2019 v5.1"}]
[{"$f":"'Hinweise - bitte beachten!!!'!A2:A2","v":"erstellt von Sören Marquardt für den Hundesportverband Rhein-Main (HSVRM)"}]
[]
["Stammdaten:",null,null,null,{"$f":"\"Anzahl Abteilungen aller Starts: \"&SUM(M5,M6,M7*1.5,M8*1.5,M9*1.5)","v":"Anzahl Abteilungen aller Starts: 0"},null,null,"Leistungsrichter:","<Name der Leistungsrichter>",null,null,null,null,"dhv Sportbeitrag (in Euro):",null,1.1000000000000001]
["Veranstalter:",null,"<Veranstaltender Verein oder Verband>",null,null,null,null,"Ringsteward Beginner","<Name RS Beginner>",null,null,"Starts",{"$f":"COUNTIF(A12:A29,\">0\")","v":0},"HSVRM Vereinsnummer:",null,"<5stellig>"]
["Titel:",null,"<Titel der Veranstaltung - z. B. Obedience-Prüfung>",null,null,null,null,"Ringsteward Klasse 1","<Name RS Klasse 1>",null,null,"Starts",{"$f":"COUNTIF(A32:A49,\">0\")","v":0},"Kreisgruppe HSVRM:",null,"<KG-Nr.>"]
["Datum:",null,"<Prüfungstag/e>",null,null,null,null,"Ringsteward Klasse 2","<Name RS Klasse 2>",null,null,"Starts",{"$f":"COUNTIF(A52:A69,\">0\")","v":0},"Prüfungsnummer:",null,"<Pr.-Nr.>"]
["PL:",null,"<Name des Prüfungsleiters>",null,null,null,null,"Ringsteward Klasse 3","<Name RS Klasse 3>",null,null,"Starts",{"$f":"COUNTIF(A72:A89,\">0\")","v":0},"Druckdatum:",null,{"$f":"TODAY()","v":"2019-09-30"}]
[null,null,null,null,null,null,null,"Ringsteward Klasse S","<Name RS Klasse S>",null,null,"Starts",{"$f":"COUNTIF(A92:A109,\">0\")","v":0}]
["Klasse Beginner: (Gruppen A, B und C)",null,null,null,null,null,null,null,null,null,null,null,null,null,{"$f":"IF(SUM('Liste Beginner'!H8:R25)=0,\"Sortieren OK\",\"KEIN Sortieren!\")","v":"Sortieren OK"}]
["Nr.","Los","Gruppe","ID","Hundeführer/-in","Verein","Verband","Hundename","Rasse","R/H","SH","Wurftag","Zucht.Nr.","Täto","Chip","LB.Nr."]
[null,null,null,{"$f":"IF(A12=\"\",\"\",A12&\" / \"&B12&\" / Beginner\")","v":""}]
[null,null,null,{"$f":"IF(A13=\"\",\"\",A13&\" / \"&B13&\" / Beginner\")","v":""}]
[null,null,null,""]
[null,null,null,""]
[null,null,null,""]
[null,null,null,""]
[null,null,null,""]
[null,null,null,""]
[null,null,null,""]
[null,null,null,""]
[null,null,null,""]
[null,null,null,""]
[null,null,null,""]
[null,null,null,""]
[null,null,null,""]
[null,null,null,""]
[null,null,null,""]
[null,null,null,""]
["Klasse 1: (Gruppen D, E und F)",null,null,null,null,null,null,null,null,null,null,null,null,null,{"$f":"IF(SUM('Liste Klasse 1'!H8:R25)=0,\"Sortieren OK\",\"KEIN Sortieren!\")","v":"Sortieren OK"}]
["Nr.","Los","Gruppe","ID","Hundeführer/-in","Verein","Verband","Hundename","Rasse","R/H","SH","Wurftag","Zucht.Nr.","Täto","Chip","LB.Nr."]
[null,null,null,{"$f":"IF(A32=\"\",\"\",A32&\" / \"&B32&\" / Klasse 1\")","v":""}]
[null,null,null,{"$f":"IF(A33=\"\",\"\",A33&\" / \"&B33&\" / Klasse 1\")","v":""}]
[null,null,null,""]
[null,null,null,""]
[null,null,null,""]
[null,null,null,""]
[null,null,null,""]
[null,null,null,""]
[null,null,null,""]
[null,null,null,""]
[null,null,null,""]
[null,null,null,""]
[null,null,null,""]
[null,null,null,""]
[null,null,null,""]
[null,null,null,""]
[null,null,null,""]
[null,null,null,""]
["Klasse 2: (Gruppen G, H und I)",null,null,null,null,null,null,null,null,null,null,null,null,null,{"$f":"IF(SUM('Liste Klasse 2'!H8:R25)=0,\"Sortieren OK\",\"KEIN Sortieren!\")","v":"Sortieren OK"}]
["Nr.","Los","Gruppe","ID","Hundeführer/-in","Verein","Verband","Hundename","Rasse","R/H","SH","Wurftag","Zucht.Nr.","Täto","Chip","LB.Nr."]
[null,null,null,{"$f":"IF(A52=\"\",\"\",A52&\" / \"&B52&\" / Klasse 2\")","v":""}]
[null,null,null,{"$f":"IF(A53=\"\",\"\",A53&\" / \"&B53&\" / Klasse 2\")","v":""}]
[null,null,null,""]
[null,null,null,""]
[null,null,null,""]
[null,null,null,""]
[null,null,null,""]
[null,null,null,""]
[null,null,null,""]
[null,null,null,""]
[null,null,null,""]
[null,null,null,""]
[null,null,null,""]
[null,null,null,""]
[null,null,null,""]
[null,null,null,""]
[null,null,null,""]
[null,null,null,""]
["Klasse 3: (Gruppen J, K und L)",null,null,null,null,null,null,null,null,null,null,null,null,null,{"$f":"IF(SUM('Liste Klasse 3'!H8:R25)=0,\"Sortieren OK\",\"KEIN Sortieren!\")","v":"Sortieren OK"}]
["Nr.","Los","Gruppe","ID","Hundeführer/-in","Verein","Verband","Hundename","Rasse","R/H","SH","Wurftag","Zucht.Nr.","Täto","Chip","LB.Nr."]
[null,null,null,{"$f":"IF(A72=\"\",\"\",A72&\" / \"&B72&\" / Klasse 3\")","v":""}]
[null,null,null,{"$f":"IF(A73=\"\",\"\",A73&\" / \"&B73&\" / Klasse 3\")","v":""}]
[null,null,null,""]
[null,null,null,""]
[null,null,null,""]
[null,null,null,""]
[null,null,null,""]
[null,null,null,""]
[null,null,null,""]
[null,null,null,""]
[null,null,null,""]
[null,null,null,""]
[null,null,null,""]
[null,null,null,""]
[null,null,null,""]
[null,null,null,""]
[null,null,null,""]
[null,null,null,""]
["Klasse S - Senior: (Gruppen M, N und O)",null,null,null,null,null,null,null,null,null,null,null,null,null,{"$f":"IF(SUM('Liste Klasse S'!H8:R25)=0,\"Sortieren OK\",\"KEIN Sortieren!\")","v":"Sortieren OK"}]
["Nr.","Los","Gruppe","ID","Hundeführer/-in","Verein","Verband","Hundename","Rasse","R/H","SH","Wurftag","Zucht.Nr.","Täto","Chip","LB.Nr."]
[null,null,null,{"$f":"IF(A92=\"\",\"\",A92&\" / \"&B92&\" / Klasse S\")","v":""}]
[null,null,null,{"$f":"IF(A93=\"\",\"\",A93&\" / \"&B93&\" / Klasse S\")","v":""}]
[null,null,null,""]
[null,null,null,""]
[null,null,null,""]
[null,null,null,""]
[null,null,null,""]
[null,null,null,""]
[null,null,null,""]
[null,null,null,""]
[null,null,null,""]
[null,null,null,""]
[null,null,null,""]
[null,null,null,""]
[null,null,null,""]
[null,null,null,""]
[null,null,null,""]
[null,null,null,""]

{"sheet":"Statistik","index":2,"n_rows":40,"n_cols":6,"rows_kept":40,"cut":false,"hidden":false,"merged":[[2,3,2,4],[6,3,6,4],[6,1,6,2],[36,0,36,1],[37,0,37,1],[37,2,37,5],[10,1,10,5],[11,1,11,5],[14,1,14,5],[39,0,39,5],[34,0,34,4],[0,0,0,5],[25,0,25,5],[26,0,26,5],[27,0,27,5],[36,2,36,5],[28,0,28,5],[4,1,4,5],[31,0,31,5],[12,1,12,5],[13,1,13,5],[29,0,29,5],[30,0,30,5],[8,1,8,5],[9,1,9,5]]}
["Hundesportverband Rhein-Main\nObedience Prüfungsstatistik"]
[]
["Prüfungsnummer",{"$f":"IF(Dateneingabe!P7=\"\",\"\",Dateneingabe!P7)","v":"<Pr.-Nr.>"},"Rechnungs-Nr.","Vereinsnummer",null,{"$f":"Dateneingabe!P5","v":"<5stellig>"}]
[]
["Verein",{"$f":"Dateneingabe!C5","v":"<Veranstaltender Verein oder Verband>"}]
[]
["Datum",{"$f":"Dateneingabe!C7","v":"<Prüfungstag/e>"},null,"Kreisgruppe",null,{"$f":"Dateneingabe!P6","v":"<KG-Nr.>"}]
[]
["Leistungsrichter/in",{"$f":"IF(Dateneingabe!I4=\"\",\"\",Dateneingabe!I4)","v":"<Name der Leistungsrichter>"}]
["Prüfungsleiter/in",{"$f":"IF(Dateneingabe!C8=\"\",\"\",Dateneingabe!C8)","v":"<Name des Prüfungsleiters>"}]
["Ringsteward Beginner",{"$f":"IF(Dateneingabe!I5=\"\",\"\",Dateneingabe!I5)","v":"<Name RS Beginner>"}]
["Ringsteward Klasse 1",{"$f":"IF(Dateneingabe!I6=\"\",\"\",Dateneingabe!I6)","v":"<Name RS Klasse 1>"}]
["Ringsteward Klasse 2",{"$f":"IF(Dateneingabe!I7=\"\",\"\",Dateneingabe!I7)","v":"<Name RS Klasse 2>"}]
["Ringsteward Klasse 3",{"$f":"IF(Dateneingabe!I8=\"\",\"\",Dateneingabe!I8)","v":"<Name RS Klasse 3>"}]
["Ringsteward Klasse S",{"$f":"IF(Dateneingabe!I9=\"\",\"\",Dateneingabe!I9)","v":"<Name RS Klasse S>"}]
[]
["Wertnotenspiegel","Beginner","Klasse 1","Klasse 2","Klasse 3","Klasse S"]
["Vorzüglich",{"$f":"COUNTIF('Liste Beginner'!T8:T25,\"V\")","v":0},{"$f":"COUNTIF('Liste Klasse 1'!T8:T25,\"V\")","v":0},{"$f":"COUNTIF('Liste Klasse 2'!T8:T25,\"V\")","v":0},{"$f":"COUNTIF('Liste Klasse 3'!T8:T25,\"V\")","v":0},{"$f":"COUNTIF('Liste Klasse S'!T8:T25,\"V\")","v":0}]
["Sehr gut",{"$f":"COUNTIF('Liste Beginner'!T8:T25,\"SG\")","v":0},{"$f":"COUNTIF('Liste Klasse 1'!T8:T25,\"SG\")","v":0},{"$f":"COUNTIF('Liste Klasse 2'!T8:T25,\"SG\")","v":0},{"$f":"COUNTIF('Liste Klasse 3'!T8:T25,\"SG\")","v":0},{"$f":"COUNTIF('Liste Klasse S'!T8:T25,\"SG\")","v":0}]
["Gut",{"$f":"COUNTIF('Liste Beginner'!T8:T25,\"G\")","v":0},{"$f":"COUNTIF('Liste Klasse 1'!T8:T25,\"G\")","v":0},{"$f":"COUNTIF('Liste Klasse 2'!T8:T25,\"G\")","v":0},{"$f":"COUNTIF('Liste Klasse 3'!T8:T25,\"G\")","v":0},{"$f":"COUNTIF('Liste Klasse S'!T8:T25,\"G\")","v":0}]
["Ohne AKZ",{"$f":"COUNTIF('Liste Beginner'!T8:T25,\"oAK\")","v":0},{"$f":"COUNTIF('Liste Klasse 1'!T8:T25,\"oAK\")","v":0},{"$f":"COUNTIF('Liste Klasse 2'!T8:T25,\"oAK\")","v":0},{"$f":"COUNTIF('Liste Klasse 3'!T8:T25,\"oAK\")","v":0},{"$f":"COUNTIF('Liste Klasse S'!T8:T25,\"oAK\")","v":0}]
["davon Disqualifiziert",{"$f":"COUNTIF('Liste Beginner'!U8:U25,\"DIS\")","v":0},{"$f":"COUNTIF('Liste Klasse 1'!U8:U25,\"DIS\")","v":0},{"$f":"COUNTIF('Liste Klasse 2'!U8:U25,\"DIS\")","v":0},{"$f":"COUNTIF('Liste Klasse 3'!U8:U25,\"DIS\")","v":0},{"$f":"COUNTIF('Liste Klasse S'!U8:U25,\"DIS\")","v":0}]
[]
["Gesamt",{"$f":"SUM(B18:B21)","v":0},{"$f":"SUM(C18:C21)","v":0},0,{"$f":"SUM(E18:E21)","v":0},0]
[]
["Die Prüfung wurde ordnungsgemäß durch den HSVRM geschützt."]
["Sämtliche Teilnehmer und Hundeeigentümer sind Mitglieder eines FCI/VDH angeschlossenen Vereins."]
["Die Identitätskontrolle wurde bei allen zur Prüfung gemeldeten Hunden durchgeführt."]
["Teilnehmer und Hunde erfüllen alle, durch die PO vorgeschriebenen, Vorraussetzungen."]
["Alle nötigen Formulare und Unterlagen der Teilnehmer, Hunde, Ringstewards"]
["und Leistungsrichter lagen vor. Die Abwicklung der Prüfung erfolgte nach den Vorgaben"]
["der FCI, des VDH, des dhv, des HSVRM und der derzeit gültigen Prüfungsordnung."]
[]
["Berechnung dhv Sportbeitrag",{"$f":"B24*Dateneingabe!P4","v":0},{"$f":"C24*Dateneingabe!P4","v":0},{"$f":"D24*Dateneingabe!P4","v":0},{"$f":"E24*Dateneingabe!P4","v":0},{"$f":"F24*Dateneingabe!P4","v":0}]
["Summe dhv Sportbeitrag",null,null,null,null,{"$f":"SUM(B34:F34)","v":0}]
[]
["Unterschrift Prüfungsleiter/in:"]
["Unterschrift/Stempel Leistungsrichter/in:"]
[]
[{"$f":"'Hinweise - bitte beachten!!!'!A1:A1&\" \"&'Hinweise - bitte beachten!!!'!A2:A2","v":"HSVRM Obedience Auswertung - Version 2019 v5.1 erstellt von Sören Marquardt für den Hundesportverband Rhein-Main (HSVRM)"}]

{"sheet":"Richterblatt","index":3,"n_rows":29,"n_cols":10,"rows_kept":29,"cut":false,"hidden":false,"merged":[[10,1,10,2],[28,0,28,9],[22,7,22,9],[17,1,17,2],[18,1,18,2],[19,1,19,2],[20,0,20,1],[20,7,20,9],[26,0,27,1],[13,1,13,2],[14,1,14,2],[15,1,15,2],[16,1,16,2],[12,1,12,2],[11,1,11,2],[5,0,5,1],[8,1,8,2],[9,1,9,2],[6,4,6,6],[5,4,5,6],[0,0,0,9],[7,0,7,9],[8,3,8,6],[1,3,1,6],[2,3,2,6],[3,3,3,6],[4,3,4,6],[2,0,4,1],[5,7,5,9],[6,7,6,9],[1,7,1,9],[2,7,2,9],[3,7,3,9],[1,0,1,1],[4,7,4,9],[6,0,6,1]]}
[{"$f":"\"HSVRM Richterblatt Obedience: \"&RIGHT(A8,8)","v":{"$error":"#N/A"}}]
["Start-Nr.",null,"HF",{"$f":"VLOOKUP($A$3,Dateneingabe!A11:P109,5,FALSE)","v":{"$error":"#N/A"}},null,null,null,{"$f":"Dateneingabe!C6","v":"<Titel der Veranstaltung - z. B. Obedience-Prüfung>"}]
[1,null,"Verein",{"$f":"VLOOKUP($A$3,Dateneingabe!A11:P109,6,FALSE)","v":{"$error":"#N/A"}},null,null,null,{"$f":"Dateneingabe!C5","v":"<Veranstaltender Verein oder Verband>"}]
[null,null,"Hundename",{"$f":"VLOOKUP($A$3,Dateneingabe!A11:P109,8,FALSE)","v":{"$error":"#N/A"}},null,null,null,"Veranstaltungstag:"]
[null,null,"Rasse",{"$f":"VLOOKUP($A$3,Dateneingabe!A11:P109,9,FALSE)","v":{"$error":"#N/A"}},null,null,null,{"$f":"Dateneingabe!C7","v":"<Prüfungstag/e>"}]
[{"$f":"VLOOKUP($A$3,Dateneingabe!A11:P109,2,FALSE)","v":{"$error":"#N/A"}},null,"SH / Täto",{"$f":"VLOOKUP($A$3,Dateneingabe!A11:P109,11,FALSE)","v":{"$error":"#N/A"}},{"$f":"VLOOKUP($A$3,Dateneingabe!A11:P109,14,FALSE)","v":{"$error":"#N/A"}},null,null,"Leistungsrichter:"]
[{"$f":"\"Gruppe: \"&VLOOKUP($A$3,Dateneingabe!A11:P109,3,FALSE)","v":{"$error":"#N/A"}},null,"WT / Chip",{"$f":"VLOOKUP($A$3,Dateneingabe!A11:P109,12,FALSE)","v":{"$error":"#N/A"}},{"$f":"VLOOKUP($A$3,Dateneingabe!A11:P109,15,FALSE)","v":{"$error":"#N/A"}},null,null,{"$f":"Dateneingabe!I4","v":"<Name der Leistungsrichter>"}]
[{"$f":"VLOOKUP($A$3,Dateneingabe!A11:P109,4,FALSE)","v":{"$error":"#N/A"}}]
["Nr.","Übung",null,"Bewertung",null,null,null,"Punkte","Koef.","Ergebnis"]
[{"$f":"IF(RIGHT(RIGHT($A$1,8),8)=\"Beginner\",'Übersicht Übungen'!A6,IF(RIGHT($A$1,8)=\"Klasse 1\",'Übersicht Übungen'!A20,IF(RIGHT($A$1,8)=\"Klasse 2\",'Übersicht Übungen'!A34,IF(RIGHT($A$1,8)=\"Klasse 3\",'Übersicht Übungen'!A48,IF(RIGHT($A$1,8)=\"Klasse S\",'Übersicht Übungen'!A62,\"---\")))))","v":{"$error":"#N/A"}},{"$f":"IF(RIGHT(RIGHT($A$1,8),8)=\"Beginner\",'Übersicht Übungen'!E6,IF(RIGHT($A$1,8)=\"Klasse 1\",'Übersicht Übungen'!E20,IF(RIGHT($A$1,8)=\"Klasse 2\",'Übersicht Übungen'!E34,IF(RIGHT($A$1,8)=\"Klasse 3\",'Übersicht Übungen'!E48,IF(RIGHT($A$1,8)=\"Klasse S\",'Übersicht Übungen'!E62,\"---\")))))","v":{"$error":"#N/A"}},null,null,null,null,null,{"$f":"IF(VLOOKUP($A$8,Gesamtergebnisliste!$A$5:$T$109,7,FALSE)=\"\",\"\",VLOOKUP($A$8,Gesamtergebnisliste!$A$5:$T$109,7,FALSE))","v":{"$error":"#N/A"}},{"$f":"IF(RIGHT(RIGHT($A$1,8),8)=\"Beginner\",'Übersicht Übungen'!C6,IF(RIGHT($A$1,8)=\"Klasse 1\",'Übersicht Übungen'!C20,IF(RIGHT($A$1,8)=\"Klasse 2\",'Übersicht Übungen'!C34,IF(RIGHT($A$1,8)=\"Klasse 3\",'Übersicht Übungen'!C48,IF(RIGHT($A$1,8)=\"Klasse S\",'Übersicht Übungen'!C62,\"---\")))))","v":{"$error":"#N/A"}},{"$f":"IF(H10=\"\",\"\",H10*I10)","v":{"$error":"#N/A"}}]
[{"$f":"IF(RIGHT(RIGHT($A$1,8),8)=\"Beginner\",'Übersicht Übungen'!A7,IF(RIGHT($A$1,8)=\"Klasse 1\",'Übersicht Übungen'!A21,IF(RIGHT($A$1,8)=\"Klasse 2\",'Übersicht Übungen'!A35,IF(RIGHT($A$1,8)=\"Klasse 3\",'Übersicht Übungen'!A49,IF(RIGHT($A$1,8)=\"Klasse S\",'Übersicht Übungen'!A63,\"---\")))))","v":{"$error":"#N/A"}},{"$f":"IF(RIGHT(RIGHT($A$1,8),8)=\"Beginner\",'Übersicht Übungen'!E7,IF(RIGHT($A$1,8)=\"Klasse 1\",'Übersicht Übungen'!E21,IF(RIGHT($A$1,8)=\"Klasse 2\",'Übersicht Übungen'!E35,IF(RIGHT($A$1,8)=\"Klasse 3\",'Übersicht Übungen'!E49,IF(RIGHT($A$1,8)=\"Klasse S\",'Übersicht Übungen'!E63,\"---\")))))","v":{"$error":"#N/A"}},null,null,null,null,null,{"$f":"IF(VLOOKUP($A$8,Gesamtergebnisliste!$A$5:$T$109,8,FALSE)=\"\",\"\",VLOOKUP($A$8,Gesamtergebnisliste!$A$5:$T$109,8,FALSE))","v":{"$error":"#N/A"}},{"$f":"IF(RIGHT(RIGHT($A$1,8),8)=\"Beginner\",'Übersicht Übungen'!C7,IF(RIGHT($A$1,8)=\"Klasse 1\",'Übersicht Übungen'!C21,IF(RIGHT($A$1,8)=\"Klasse 2\",'Übersicht Übungen'!C35,IF(RIGHT($A$1,8)=\"Klasse 3\",'Übersicht Übungen'!C49,IF(RIGHT($A$1,8)=\"Klasse S\",'Übersicht Übungen'!C63,\"---\")))))","v":{"$error":"#N/A"}},{"$f":"IF(H11=\"\",\"\",H11*I11)","v":{"$error":"#N/A"}}]
[{"$f":"IF(RIGHT(RIGHT($A$1,8),8)=\"Beginner\",'Übersicht Übungen'!A8,IF(RIGHT($A$1,8)=\"Klasse 1\",'Übersicht Übungen'!A22,IF(RIGHT($A$1,8)=\"Klasse 2\",'Übersicht Übungen'!A36,IF(RIGHT($A$1,8)=\"Klasse 3\",'Übersicht Übungen'!A50,IF(RIGHT($A$1,8)=\"Klasse S\",'Übersicht Übungen'!A64,\"---\")))))","v":{"$error":"#N/A"}},{"$f":"IF(RIGHT(RIGHT($A$1,8),8)=\"Beginner\",'Übersicht Übungen'!E8,IF(RIGHT($A$1,8)=\"Klasse 1\",'Übersicht Übungen'!E22,IF(RIGHT($A$1,8)=\"Klasse 2\",'Übersicht Übungen'!E36,IF(RIGHT($A$1,8)=\"Klasse 3\",'Übersicht Übungen'!E50,IF(RIGHT($A$1,8)=\"Klasse S\",'Übersicht Übungen'!E64,\"---\")))))","v":{"$error":"#N/A"}},null,null,null,null,null,{"$f":"IF(VLOOKUP($A$8,Gesamtergebnisliste!$A$5:$T$109,9,FALSE)=\"\",\"\",VLOOKUP($A$8,Gesamtergebnisliste!$A$5:$T$109,9,FALSE))","v":{"$error":"#N/A"}},{"$f":"IF(RIGHT(RIGHT($A$1,8),8)=\"Beginner\",'Übersicht Übungen'!C8,IF(RIGHT($A$1,8)=\"Klasse 1\",'Übersicht Übungen'!C22,IF(RIGHT($A$1,8)=\"Klasse 2\",'Übersicht Übungen'!C36,IF(RIGHT($A$1,8)=\"Klasse 3\",'Übersicht Übungen'!C50,IF(RIGHT($A$1,8)=\"Klasse S\",'Übersicht Übungen'!C64,\"---\")))))","v":{"$error":"#N/A"}},{"$error":"#N/A"}]
[{"$f":"IF(RIGHT(RIGHT($A$1,8),8)=\"Beginner\",'Übersicht Übungen'!A9,IF(RIGHT($A$1,8)=\"Klasse 1\",'Übersicht Übungen'!A23,IF(RIGHT($A$1,8)=\"Klasse 2\",'Übersicht Übungen'!A37,IF(RIGHT($A$1,8)=\"Klasse 3\",'Übersicht Übungen'!A51,IF(RIGHT($A$1,8)=\"Klasse S\",'Übersicht Übungen'!A65,\"---\")))))","v":{"$error":"#N/A"}},{"$f":"IF(RIGHT(RIGHT($A$1,8),8)=\"Beginner\",'Übersicht Übungen'!E9,IF(RIGHT($A$1,8)=\"Klasse 1\",'Übersicht Übungen'!E23,IF(RIGHT($A$1,8)=\"Klasse 2\",'Übersicht Übungen'!E37,IF(RIGHT($A$1,8)=\"Klasse 3\",'Übersicht Übungen'!E51,IF(RIGHT($A$1,8)=\"Klasse S\",'Übersicht Übungen'!E65,\"---\")))))","v":{"$error":"#N/A"}},null,null,null,null,null,{"$f":"IF(VLOOKUP($A$8,Gesamtergebnisliste!$A$5:$T$109,10,FALSE)=\"\",\"\",VLOOKUP($A$8,Gesamtergebnisliste!$A$5:$T$109,10,FALSE))","v":{"$error":"#N/A"}},{"$f":"IF(RIGHT(RIGHT($A$1,8),8)=\"Beginner\",'Übersicht Übungen'!C9,IF(RIGHT($A$1,8)=\"Klasse 1\",'Übersicht Übungen'!C23,IF(RIGHT($A$1,8)=\"Klasse 2\",'Übersicht Übungen'!C37,IF(RIGHT($A$1,8)=\"Klasse 3\",'Übersicht Übungen'!C51,IF(RIGHT($A$1,8)=\"Klasse S\",'Übersicht Übungen'!C65,\"---\")))))","v":{"$error":"#N/A"}},{"$error":"#N/A"}]
[{"$f":"IF(RIGHT(RIGHT($A$1,8),8)=\"Beginner\",'Übersicht Übungen'!A10,IF(RIGHT($A$1,8)=\"Klasse 1\",'Übersicht Übungen'!A24,IF(RIGHT($A$1,8)=\"Klasse 2\",'Übersicht Übungen'!A38,IF(RIGHT($A$1,8)=\"Klasse 3\",'Übersicht Übungen'!A52,IF(RIGHT($A$1,8)=\"Klasse S\",'Übersicht Übungen'!A66,\"---\")))))","v":{"$error":"#N/A"}},{"$f":"IF(RIGHT(RIGHT($A$1,8),8)=\"Beginner\",'Übersicht Übungen'!E10,IF(RIGHT($A$1,8)=\"Klasse 1\",'Übersicht Übungen'!E24,IF(RIGHT($A$1,8)=\"Klasse 2\",'Übersicht Übungen'!E38,IF(RIGHT($A$1,8)=\"Klasse 3\",'Übersicht Übungen'!E52,IF(RIGHT($A$1,8)=\"Klasse S\",'Übersicht Übungen'!E66,\"---\")))))","v":{"$error":"#N/A"}},null,null,null,null,null,{"$f":"IF(VLOOKUP($A$8,Gesamtergebnisliste!$A$5:$T$109,11,FALSE)=\"\",\"\",VLOOKUP($A$8,Gesamtergebnisliste!$A$5:$T$109,11,FALSE))","v":{"$error":"#N/A"}},{"$f":"IF(RIGHT(RIGHT($A$1,8),8)=\"Beginner\",'Übersicht Übungen'!C10,IF(RIGHT($A$1,8)=\"Klasse 1\",'Übersicht Übungen'!C24,IF(RIGHT($A$1,8)=\"Klasse 2\",'Übersicht Übungen'!C38,IF(RIGHT($A$1,8)=\"Klasse 3\",'Übersicht Übungen'!C52,IF(RIGHT($A$1,8)=\"Klasse S\",'Übersicht Übungen'!C66,\"---\")))))","v":{"$error":"#N/A"}},{"$error":"#N/A"}]
[{"$f":"IF(RIGHT(RIGHT($A$1,8),8)=\"Beginner\",'Übersicht Übungen'!A11,IF(RIGHT($A$1,8)=\"Klasse 1\",'Übersicht Übungen'!A25,IF(RIGHT($A$1,8)=\"Klasse 2\",'Übersicht Übungen'!A39,IF(RIGHT($A$1,8)=\"Klasse 3\",'Übersicht Übungen'!A53,IF(RIGHT($A$1,8)=\"Klasse S\",'Übersicht Übungen'!A67,\"---\")))))","v":{"$error":"#N/A"}},{"$f":"IF(RIGHT(RIGHT($A$1,8),8)=\"Beginner\",'Übersicht Übungen'!E11,IF(RIGHT($A$1,8)=\"Klasse 1\",'Übersicht Übungen'!E25,IF(RIGHT($A$1,8)=\"Klasse 2\",'Übersicht Übungen'!E39,IF(RIGHT($A$1,8)=\"Klasse 3\",'Übersicht Übungen'!E53,IF(RIGHT($A$1,8)=\"Klasse S\",'Übersicht Übungen'!E67,\"---\")))))","v":{"$error":"#N/A"}},null,null,null,null,null,{"$f":"IF(VLOOKUP($A$8,Gesamtergebnisliste!$A$5:$T$109,12,FALSE)=\"\",\"\",VLOOKUP($A$8,Gesamtergebnisliste!$A$5:$T$109,12,FALSE))","v":{"$error":"#N/A"}},{"$f":"IF(RIGHT(RIGHT($A$1,8),8)=\"Beginner\",'Übersicht Übungen'!C11,IF(RIGHT($A$1,8)=\"Klasse 1\",'Übersicht Übungen'!C25,IF(RIGHT($A$1,8)=\"Klasse 2\",'Übersicht Übungen'!C39,IF(RIGHT($A$1,8)=\"Klasse 3\",'Übersicht Übungen'!C53,IF(RIGHT($A$1,8)=\"Klasse S\",'Übersicht Übungen'!C67,\"---\")))))","v":{"$error":"#N/A"}},{"$error":"#N/A"}]
[{"$f":"IF(RIGHT(RIGHT($A$1,8),8)=\"Beginner\",'Übersicht Übungen'!A12,IF(RIGHT($A$1,8)=\"Klasse 1\",'Übersicht Übungen'!A26,IF(RIGHT($A$1,8)=\"Klasse 2\",'Übersicht Übungen'!A40,IF(RIGHT($A$1,8)=\"Klasse 3\",'Übersicht Übungen'!A54,IF(RIGHT($A$1,8)=\"Klasse S\",'Übersicht Übungen'!A68,\"---\")))))","v":{"$error":"#N/A"}},{"$f":"IF(RIGHT(RIGHT($A$1,8),8)=\"Beginner\",'Übersicht Übungen'!E12,IF(RIGHT($A$1,8)=\"Klasse 1\",'Übersicht Übungen'!E26,IF(RIGHT($A$1,8)=\"Klasse 2\",'Übersicht Übungen'!E40,IF(RIGHT($A$1,8)=\"Klasse 3\",'Übersicht Übungen'!E54,IF(RIGHT($A$1,8)=\"Klasse S\",'Übersicht Übungen'!E68,\"---\")))))","v":{"$error":"#N/A"}},null,null,null,null,null,{"$f":"IF(VLOOKUP($A$8,Gesamtergebnisliste!$A$5:$T$109,13,FALSE)=\"\",\"\",VLOOKUP($A$8,Gesamtergebnisliste!$A$5:$T$109,13,FALSE))","v":{"$error":"#N/A"}},{"$f":"IF(RIGHT(RIGHT($A$1,8),8)=\"Beginner\",'Übersicht Übungen'!C12,IF(RIGHT($A$1,8)=\"Klasse 1\",'Übersicht Übungen'!C26,IF(RIGHT($A$1,8)=\"Klasse 2\",'Übersicht Übungen'!C40,IF(RIGHT($A$1,8)=\"Klasse 3\",'Übersicht Übungen'!C54,IF(RIGHT($A$1,8)=\"Klasse S\",'Übersicht Übungen'!C68,\"---\")))))","v":{"$error":"#N/A"}},{"$error":"#N/A"}]
[{"$f":"IF(RIGHT(RIGHT($A$1,8),8)=\"Beginner\",'Übersicht Übungen'!A13,IF(RIGHT($A$1,8)=\"Klasse 1\",'Übersicht Übungen'!A27,IF(RIGHT($A$1,8)=\"Klasse 2\",'Übersicht Übungen'!A41,IF(RIGHT($A$1,8)=\"Klasse 3\",'Übersicht Übungen'!A55,IF(RIGHT($A$1,8)=\"Klasse S\",'Übersicht Übungen'!A69,\"---\")))))","v":{"$error":"#N/A"}},{"$f":"IF(RIGHT(RIGHT($A$1,8),8)=\"Beginner\",'Übersicht Übungen'!E13,IF(RIGHT($A$1,8)=\"Klasse 1\",'Übersicht Übungen'!E27,IF(RIGHT($A$1,8)=\"Klasse 2\",'Übersicht Übungen'!E41,IF(RIGHT($A$1,8)=\"Klasse 3\",'Übersicht Übungen'!E55,IF(RIGHT($A$1,8)=\"Klasse S\",'Übersicht Übungen'!E69,\"---\")))))","v":{"$error":"#N/A"}},null,null,null,null,null,{"$f":"IF(VLOOKUP($A$8,Gesamtergebnisliste!$A$5:$T$109,14,FALSE)=\"\",\"\",VLOOKUP($A$8,Gesamtergebnisliste!$A$5:$T$109,14,FALSE))","v":{"$error":"#N/A"}},{"$f":"IF(RIGHT(RIGHT($A$1,8),8)=\"Beginner\",'Übersicht Übungen'!C13,IF(RIGHT($A$1,8)=\"Klasse 1\",'Übersicht Übungen'!C27,IF(RIGHT($A$1,8)=\"Klasse 2\",'Übersicht Übungen'!C41,IF(RIGHT($A$1,8)=\"Klasse 3\",'Übersicht Übungen'!C55,IF(RIGHT($A$1,8)=\"Klasse S\",'Übersicht Übungen'!C69,\"---\")))))","v":{"$error":"#N/A"}},{"$error":"#N/A"}]
[{"$f":"IF(RIGHT(RIGHT($A$1,8),8)=\"Beginner\",'Übersicht Übungen'!A14,IF(RIGHT($A$1,8)=\"Klasse 1\",'Übersicht Übungen'!A28,IF(RIGHT($A$1,8)=\"Klasse 2\",'Übersicht Übungen'!A42,IF(RIGHT($A$1,8)=\"Klasse 3\",'Übersicht Übungen'!A56,IF(RIGHT($A$1,8)=\"Klasse S\",'Übersicht Übungen'!A70,\"---\")))))","v":{"$error":"#N/A"}},{"$f":"IF(RIGHT(RIGHT($A$1,8),8)=\"Beginner\",'Übersicht Übungen'!E14,IF(RIGHT($A$1,8)=\"Klasse 1\",'Übersicht Übungen'!E28,IF(RIGHT($A$1,8)=\"Klasse 2\",'Übersicht Übungen'!E42,IF(RIGHT($A$1,8)=\"Klasse 3\",'Übersicht Übungen'!E56,IF(RIGHT($A$1,8)=\"Klasse S\",'Übersicht Übungen'!E70,\"---\")))))","v":{"$error":"#N/A"}},null,null,null,null,null,{"$f":"IF(VLOOKUP($A$8,Gesamtergebnisliste!$A$5:$T$109,15,FALSE)=\"\",\"\",VLOOKUP($A$8,Gesamtergebnisliste!$A$5:$T$109,15,FALSE))","v":{"$error":"#N/A"}},{"$f":"IF(RIGHT(RIGHT($A$1,8),8)=\"Beginner\",'Übersicht Übungen'!C14,IF(RIGHT($A$1,8)=\"Klasse 1\",'Übersicht Übungen'!C28,IF(RIGHT($A$1,8)=\"Klasse 2\",'Übersicht Übungen'!C42,IF(RIGHT($A$1,8)=\"Klasse 3\",'Übersicht Übungen'!C56,IF(RIGHT($A$1,8)=\"Klasse S\",'Übersicht Übungen'!C70,\"---\")))))","v":{"$error":"#N/A"}},{"$error":"#N/A"}]
[{"$f":"IF(RIGHT(RIGHT($A$1,8),8)=\"Beginner\",'Übersicht Übungen'!A15,IF(RIGHT($A$1,8)=\"Klasse 1\",'Übersicht Übungen'!A29,IF(RIGHT($A$1,8)=\"Klasse 2\",'Übersicht Übungen'!A43,IF(RIGHT($A$1,8)=\"Klasse 3\",'Übersicht Übungen'!A57,IF(RIGHT($A$1,8)=\"Klasse S\",'Übersicht Übungen'!A71,\"---\")))))","v":{"$error":"#N/A"}},{"$f":"IF(RIGHT(RIGHT($A$1,8),8)=\"Beginner\",'Übersicht Übungen'!E15,IF(RIGHT($A$1,8)=\"Klasse 1\",'Übersicht Übungen'!E29,IF(RIGHT($A$1,8)=\"Klasse 2\",'Übersicht Übungen'!E43,IF(RIGHT($A$1,8)=\"Klasse 3\",'Übersicht Übungen'!E57,IF(RIGHT($A$1,8)=\"Klasse S\",'Übersicht Übungen'!E71,\"---\")))))","v":{"$error":"#N/A"}},null,null,null,null,null,{"$f":"IF(VLOOKUP($A$8,Gesamtergebnisliste!$A$5:$T$109,16,FALSE)=\"\",\"\",VLOOKUP($A$8,Gesamtergebnisliste!$A$5:$T$109,16,FALSE))","v":{"$error":"#N/A"}},{"$f":"IF(RIGHT(RIGHT($A$1,8),8)=\"Beginner\",'Übersicht Übungen'!C15,IF(RIGHT($A$1,8)=\"Klasse 1\",'Übersicht Übungen'!C29,IF(RIGHT($A$1,8)=\"Klasse 2\",'Übersicht Übungen'!C43,IF(RIGHT($A$1,8)=\"Klasse 3\",'Übersicht Übungen'!C57,IF(RIGHT($A$1,8)=\"Klasse S\",'Übersicht Übungen'!C71,\"---\")))))","v":{"$error":"#N/A"}},{"$error":"#N/A"}]
[{"$f":"IF(RIGHT(RIGHT($A$1,8),8)=\"Beginner\",'Übersicht Übungen'!A16,IF(RIGHT($A$1,8)=\"Klasse 1\",'Übersicht Übungen'!A30,IF(RIGHT($A$1,8)=\"Klasse 2\",'Übersicht Übungen'!A44,IF(RIGHT($A$1,8)=\"Klasse 3\",'Übersicht Übungen'!A58,IF(RIGHT($A$1,8)=\"Klasse S\",'Übersicht Übungen'!A72,\"---\")))))","v":{"$error":"#N/A"}},{"$f":"IF(RIGHT(RIGHT($A$1,8),8)=\"Beginner\",'Übersicht Übungen'!E16,IF(RIGHT($A$1,8)=\"Klasse 1\",'Übersicht Übungen'!E30,IF(RIGHT($A$1,8)=\"Klasse 2\",'Übersicht Übungen'!E44,IF(RIGHT($A$1,8)=\"Klasse 3\",'Übersicht Übungen'!E58,IF(RIGHT($A$1,8)=\"Klasse S\",'Übersicht Übungen'!E72,\"---\")))))","v":{"$error":"#N/A"}},null,null,null,null,null,{"$f":"IF(VLOOKUP($A$8,Gesamtergebnisliste!$A$5:$T$109,17,FALSE)=\"\",\"\",VLOOKUP($A$8,Gesamtergebnisliste!$A$5:$T$109,17,FALSE))","v":{"$error":"#N/A"}},{"$f":"IF(RIGHT(RIGHT($A$1,8),8)=\"Beginner\",'Übersicht Übungen'!C16,IF(RIGHT($A$1,8)=\"Klasse 1\",'Übersicht Übungen'!C30,IF(RIGHT($A$1,8)=\"Klasse 2\",'Übersicht Übungen'!C44,IF(RIGHT($A$1,8)=\"Klasse 3\",'Übersicht Übungen'!C58,IF(RIGHT($A$1,8)=\"Klasse S\",'Übersicht Übungen'!C72,\"---\")))))","v":{"$error":"#N/A"}},{"$f":"IF(H20=-10,-10,IF(H20=\"\",\"\",H20*I20))","v":{"$error":"#N/A"}}]
["WN:",null,{"$f":"IF(H21=\"\",\"\",IF(H21>J26,\"V\",IF(H21>J27,\"SG\",IF(H21>J28,\"G\",\"NB\"))))","v":{"$error":"#N/A"}},null,null,null,"Summe:",{"$f":"IF(SUM(J10:J20)=0,\"\",(SUM(J10:J20)-A27))","v":{"$error":"#N/A"}}]
[null,null,null,null,null,null,null,null,null,{"$f":"RIGHT($A$8,8)","v":{"$error":"#N/A"}}]
[null,"1. Gelbe Karte",null,"Unterschrift / Stempel Leistungsrichter Obedience:",null,null,null,"Wertnotenschlüssel"]
[null,"2. Gelbe Karte",null,null,null,null,null,"WN","von","bis"]
[null,"Rote Karte",null,null,null,null,null,"V",{"$f":"IF(OR($J$22=\"Beginner\",$J$22=\"Klasse 1\"),'Übersicht Übungen'!H7,'Übersicht Übungen'!H35)","v":{"$error":"#N/A"}},{"$f":"IF(OR($J$22=\"Beginner\",$J$22=\"Klasse 1\"),'Übersicht Übungen'!I7,'Übersicht Übungen'!I35)","v":{"$error":"#N/A"}}]
[null,"Disqualifikation",null,null,null,null,null,"SG",{"$f":"IF(OR($J$22=\"Beginner\",$J$22=\"Klasse 1\"),'Übersicht Übungen'!H8,'Übersicht Übungen'!H36)","v":{"$error":"#N/A"}},{"$f":"IF(OR($J$22=\"Beginner\",$J$22=\"Klasse 1\"),'Übersicht Übungen'!I8,'Übersicht Übungen'!I36)","v":{"$error":"#N/A"}}]
[null,null,null,null,null,null,null,"G",{"$f":"IF(OR($J$22=\"Beginner\",$J$22=\"Klasse 1\"),'Übersicht Übungen'!H9,'Übersicht Übungen'!H37)","v":{"$error":"#N/A"}},{"$f":"IF(OR($J$22=\"Beginner\",$J$22=\"Klasse 1\"),'Übersicht Übungen'!I9,'Übersicht Übungen'!I37)","v":{"$error":"#N/A"}}]
[null,null,"Punktabzug",null,null,null,null,"ohne AK",{"$f":"IF(OR($J$22=\"Beginner\",$J$22=\"Klasse 1\"),'Übersicht Übungen'!H10,'Übersicht Übungen'!H38)","v":{"$error":"#N/A"}},{"$f":"IF(OR($J$22=\"Beginner\",$J$22=\"Klasse 1\"),'Übersicht Übungen'!I10,'Übersicht Übungen'!I38)","v":{"$error":"#N/A"}}]
[{"$f":"'Hinweise - bitte beachten!!!'!A1:A1&\" - \"&'Hinweise - bitte beachten!!!'!A2:A2","v":"HSVRM Obedience Auswertung - Version 2019 v5.1 - erstellt von Sören Marquardt für den Hundesportverband Rhein-Main (HSVRM)"}]

{"sheet":"Richterblatt Gruppe","index":4,"n_rows":108,"n_cols":7,"rows_kept":108,"cut":false,"hidden":false,"merged":[[40,0,41,0],[47,0,48,0],[54,0,55,0],[5,0,6,0],[12,0,13,0],[19,0,20,0],[26,0,27,0],[33,0,34,0],[0,0,0,6],[1,0,1,6],[2,0,2,5],[3,3,3,5],[3,0,3,2],[61,0,62,0],[68,0,69,0],[89,0,90,0],[96,0,97,0],[103,0,104,0],[75,0,76,0],[82,0,83,0]]}
[{"$f":"'Hinweise - bitte beachten!!!'!A1:A1&\" - \"&'Hinweise - bitte beachten!!!'!A2:A2","v":"HSVRM Obedience Auswertung - Version 2019 v5.1 - erstellt von Sören Marquardt für den Hundesportverband Rhein-Main (HSVRM)"}]
["HSVRM Gruppen-Richterblatt Obedience"]
[{"$f":"Dateneingabe!C6","v":"<Titel der Veranstaltung - z. B. Obedience-Prüfung>"},null,null,null,null,null,"Datum:"]
[{"$f":"\"Veranstalter: \"&Dateneingabe!C5","v":"Veranstalter: <Veranstaltender Verein oder Verband>"},null,null,{"$f":"\"LR: \"&Dateneingabe!I4","v":"LR: <Name der Leistungsrichter>"},null,null,{"$f":"Dateneingabe!C7","v":"<Prüfungstag/e>"}]
[]
["BEG",{"$f":"IF(ISERROR(VLOOKUP(B$8,Dateneingabe!$C$12:$H$29,3,FALSE)),\"---\",VLOOKUP(B$8,Dateneingabe!$C$12:$H$29,3,FALSE))","v":"---"},{"$f":"IF(ISERROR(VLOOKUP(C$8,Dateneingabe!$C$12:$H$29,3,FALSE)),\"---\",VLOOKUP(C$8,Dateneingabe!$C$12:$H$29,3,FALSE))","v":"---"},{"$f":"IF(ISERROR(VLOOKUP(D$8,Dateneingabe!$C$12:$H$29,3,FALSE)),\"---\",VLOOKUP(D$8,Dateneingabe!$C$12:$H$29,3,FALSE))","v":"---"},{"$f":"IF(ISERROR(VLOOKUP(E$8,Dateneingabe!$C$12:$H$29,3,FALSE)),\"---\",VLOOKUP(E$8,Dateneingabe!$C$12:$H$29,3,FALSE))","v":"---"},{"$f":"IF(ISERROR(VLOOKUP(F$8,Dateneingabe!$C$12:$H$29,3,FALSE)),\"---\",VLOOKUP(F$8,Dateneingabe!$C$12:$H$29,3,FALSE))","v":"---"},{"$f":"IF(ISERROR(VLOOKUP(G$8,Dateneingabe!$C$12:$H$29,3,FALSE)),\"---\",VLOOKUP(G$8,Dateneingabe!$C$12:$H$29,3,FALSE))","v":"---"}]
[null,{"$f":"IF(ISERROR(VLOOKUP(B$8,Dateneingabe!$C$12:$H$29,3,FALSE)),\"---\",VLOOKUP(B$8,Dateneingabe!$C$12:$H$29,6,FALSE))","v":"---"},{"$f":"IF(ISERROR(VLOOKUP(C$8,Dateneingabe!$C$12:$H$29,3,FALSE)),\"---\",VLOOKUP(C$8,Dateneingabe!$C$12:$H$29,6,FALSE))","v":"---"},{"$f":"IF(ISERROR(VLOOKUP(D$8,Dateneingabe!$C$12:$H$29,3,FALSE)),\"---\",VLOOKUP(D$8,Dateneingabe!$C$12:$H$29,6,FALSE))","v":"---"},{"$f":"IF(ISERROR(VLOOKUP(E$8,Dateneingabe!$C$12:$H$29,3,FALSE)),\"---\",VLOOKUP(E$8,Dateneingabe!$C$12:$H$29,6,FALSE))","v":"---"},{"$f":"IF(ISERROR(VLOOKUP(F$8,Dateneingabe!$C$12:$H$29,3,FALSE)),\"---\",VLOOKUP(F$8,Dateneingabe!$C$12:$H$29,6,FALSE))","v":"---"},{"$f":"IF(ISERROR(VLOOKUP(G$8,Dateneingabe!$C$12:$H$29,3,FALSE)),\"---\",VLOOKUP(G$8,Dateneingabe!$C$12:$H$29,6,FALSE))","v":"---"}]
["Gruppe","A1","A2","A3","A4","A5","A6"]
["ID (Startnr., Los, Klasse)",{"$f":"IF(ISERROR(VLOOKUP(B$8,Dateneingabe!$C$12:$E$29,2,FALSE)),\"---\",VLOOKUP(B$8,Dateneingabe!$C$12:$E$29,2,FALSE))","v":"---"},{"$f":"IF(ISERROR(VLOOKUP(C$8,Dateneingabe!$C$12:$E$29,2,FALSE)),\"---\",VLOOKUP(C$8,Dateneingabe!$C$12:$E$29,2,FALSE))","v":"---"},{"$f":"IF(ISERROR(VLOOKUP(D$8,Dateneingabe!$C$12:$E$29,2,FALSE)),\"---\",VLOOKUP(D$8,Dateneingabe!$C$12:$E$29,2,FALSE))","v":"---"},{"$f":"IF(ISERROR(VLOOKUP(E$8,Dateneingabe!$C$12:$E$29,2,FALSE)),\"---\",VLOOKUP(E$8,Dateneingabe!$C$12:$E$29,2,FALSE))","v":"---"},{"$f":"IF(ISERROR(VLOOKUP(F$8,Dateneingabe!$C$12:$E$29,2,FALSE)),\"---\",VLOOKUP(F$8,Dateneingabe!$C$12:$E$29,2,FALSE))","v":"---"},{"$f":"IF(ISERROR(VLOOKUP(G$8,Dateneingabe!$C$12:$E$29,2,FALSE)),\"---\",VLOOKUP(G$8,Dateneingabe!$C$12:$E$29,2,FALSE))","v":"---"}]
[{"$f":"'Übersicht Übungen'!$A$6&\". Übung: \n\"&'Übersicht Übungen'!$E$6","v":"1. Übung: \nVerhalten gegenüber anderen Hunden"}]
[{"$f":"'Übersicht Übungen'!$A$7&\". Übung: \n\"&'Übersicht Übungen'!$E$7","v":"2. Übung: \nStehen und Betasten"}]
[{"$f":"'Übersicht Übungen'!$A$8&\". Übung: \n\"&'Übersicht Übungen'!$E$8","v":"3. Übung: \n2 Minuten Liegen mit Sichtkontakt"}]
["BEG",{"$f":"IF(ISERROR(VLOOKUP(B$15,Dateneingabe!$C$12:$H$29,3,FALSE)),\"---\",VLOOKUP(B$15,Dateneingabe!$C$12:$H$29,3,FALSE))","v":"---"},{"$f":"IF(ISERROR(VLOOKUP(C$15,Dateneingabe!$C$12:$H$29,3,FALSE)),\"---\",VLOOKUP(C$15,Dateneingabe!$C$12:$H$29,3,FALSE))","v":"---"},{"$f":"IF(ISERROR(VLOOKUP(D$15,Dateneingabe!$C$12:$H$29,3,FALSE)),\"---\",VLOOKUP(D$15,Dateneingabe!$C$12:$H$29,3,FALSE))","v":"---"},{"$f":"IF(ISERROR(VLOOKUP(E$15,Dateneingabe!$C$12:$H$29,3,FALSE)),\"---\",VLOOKUP(E$15,Dateneingabe!$C$12:$H$29,3,FALSE))","v":"---"},{"$f":"IF(ISERROR(VLOOKUP(F$15,Dateneingabe!$C$12:$H$29,3,FALSE)),\"---\",VLOOKUP(F$15,Dateneingabe!$C$12:$H$29,3,FALSE))","v":"---"},{"$f":"IF(ISERROR(VLOOKUP(G$15,Dateneingabe!$C$12:$H$29,3,FALSE)),\"---\",VLOOKUP(G$15,Dateneingabe!$C$12:$H$29,3,FALSE))","v":"---"}]
[null,{"$f":"IF(ISERROR(VLOOKUP(B$15,Dateneingabe!$C$12:$H$29,3,FALSE)),\"---\",VLOOKUP(B$15,Dateneingabe!$C$12:$H$29,6,FALSE))","v":"---"},{"$f":"IF(ISERROR(VLOOKUP(C$15,Dateneingabe!$C$12:$H$29,3,FALSE)),\"---\",VLOOKUP(C$15,Dateneingabe!$C$12:$H$29,6,FALSE))","v":"---"},{"$f":"IF(ISERROR(VLOOKUP(D$15,Dateneingabe!$C$12:$H$29,3,FALSE)),\"---\",VLOOKUP(D$15,Dateneingabe!$C$12:$H$29,6,FALSE))","v":"---"},{"$f":"IF(ISERROR(VLOOKUP(E$15,Dateneingabe!$C$12:$H$29,3,FALSE)),\"---\",VLOOKUP(E$15,Dateneingabe!$C$12:$H$29,6,FALSE))","v":"---"},{"$f":"IF(ISERROR(VLOOKUP(F$15,Dateneingabe!$C$12:$H$29,3,FALSE)),\"---\",VLOOKUP(F$15,Dateneingabe!$C$12:$H$29,6,FALSE))","v":"---"},{"$f":"IF(ISERROR(VLOOKUP(G$15,Dateneingabe!$C$12:$H$29,3,FALSE)),\"---\",VLOOKUP(G$15,Dateneingabe!$C$12:$H$29,6,FALSE))","v":"---"}]
["Gruppe","B1","B2","B3","B4","B5","B6"]
["ID (Startnr., Los, Klasse)",{"$f":"IF(ISERROR(VLOOKUP(B$15,Dateneingabe!$C$12:$E$29,2,FALSE)),\"---\",VLOOKUP(B$15,Dateneingabe!$C$12:$E$29,2,FALSE))","v":"---"},{"$f":"IF(ISERROR(VLOOKUP(C$15,Dateneingabe!$C$12:$E$29,2,FALSE)),\"---\",VLOOKUP(C$15,Dateneingabe!$C$12:$E$29,2,FALSE))","v":"---"},{"$f":"IF(ISERROR(VLOOKUP(D$15,Dateneingabe!$C$12:$E$29,2,FALSE)),\"---\",VLOOKUP(D$15,Dateneingabe!$C$12:$E$29,2,FALSE))","v":"---"},{"$f":"IF(ISERROR(VLOOKUP(E$15,Dateneingabe!$C$12:$E$29,2,FALSE)),\"---\",VLOOKUP(E$15,Dateneingabe!$C$12:$E$29,2,FALSE))","v":"---"},{"$f":"IF(ISERROR(VLOOKUP(F$15,Dateneingabe!$C$12:$E$29,2,FALSE)),\"---\",VLOOKUP(F$15,Dateneingabe!$C$12:$E$29,2,FALSE))","v":"---"},{"$f":"IF(ISERROR(VLOOKUP(G$15,Dateneingabe!$C$12:$E$29,2,FALSE)),\"---\",VLOOKUP(G$15,Dateneingabe!$C$12:$E$29,2,FALSE))","v":"---"}]
[{"$f":"'Übersicht Übungen'!$A$6&\". Übung: \n\"&'Übersicht Übungen'!$E$6","v":"1. Übung: \nVerhalten gegenüber anderen Hunden"}]
[{"$f":"'Übersicht Übungen'!$A$7&\". Übung: \n\"&'Übersicht Übungen'!$E$7","v":"2. Übung: \nStehen und Betasten"}]
[{"$f":"'Übersicht Übungen'!$A$8&\". Übung: \n\"&'Übersicht Übungen'!$E$8","v":"3. Übung: \n2 Minuten Liegen mit Sichtkontakt"}]
["BEG",{"$f":"IF(ISERROR(VLOOKUP(B$22,Dateneingabe!$C$12:$H$29,3,FALSE)),\"---\",VLOOKUP(B$22,Dateneingabe!$C$12:$H$29,3,FALSE))","v":"---"},{"$f":"IF(ISERROR(VLOOKUP(C$22,Dateneingabe!$C$12:$H$29,3,FALSE)),\"---\",VLOOKUP(C$22,Dateneingabe!$C$12:$H$29,3,FALSE))","v":"---"},{"$f":"IF(ISERROR(VLOOKUP(D$22,Dateneingabe!$C$12:$H$29,3,FALSE)),\"---\",VLOOKUP(D$22,Dateneingabe!$C$12:$H$29,3,FALSE))","v":"---"},{"$f":"IF(ISERROR(VLOOKUP(E$22,Dateneingabe!$C$12:$H$29,3,FALSE)),\"---\",VLOOKUP(E$22,Dateneingabe!$C$12:$H$29,3,FALSE))","v":"---"},{"$f":"IF(ISERROR(VLOOKUP(F$22,Dateneingabe!$C$12:$H$29,3,FALSE)),\"---\",VLOOKUP(F$22,Dateneingabe!$C$12:$H$29,3,FALSE))","v":"---"},{"$f":"IF(ISERROR(VLOOKUP(G$22,Dateneingabe!$C$12:$H$29,3,FALSE)),\"---\",VLOOKUP(G$22,Dateneingabe!$C$12:$H$29,3,FALSE))","v":"---"}]
[null,{"$f":"IF(ISERROR(VLOOKUP(B$22,Dateneingabe!$C$12:$H$29,3,FALSE)),\"---\",VLOOKUP(B$22,Dateneingabe!$C$12:$H$29,6,FALSE))","v":"---"},{"$f":"IF(ISERROR(VLOOKUP(C$22,Dateneingabe!$C$12:$H$29,3,FALSE)),\"---\",VLOOKUP(C$22,Dateneingabe!$C$12:$H$29,6,FALSE))","v":"---"},{"$f":"IF(ISERROR(VLOOKUP(D$22,Dateneingabe!$C$12:$H$29,3,FALSE)),\"---\",VLOOKUP(D$22,Dateneingabe!$C$12:$H$29,6,FALSE))","v":"---"},{"$f":"IF(ISERROR(VLOOKUP(E$22,Dateneingabe!$C$12:$H$29,3,FALSE)),\"---\",VLOOKUP(E$22,Dateneingabe!$C$12:$H$29,6,FALSE))","v":"---"},{"$f":"IF(ISERROR(VLOOKUP(F$22,Dateneingabe!$C$12:$H$29,3,FALSE)),\"---\",VLOOKUP(F$22,Dateneingabe!$C$12:$H$29,6,FALSE))","v":"---"},{"$f":"IF(ISERROR(VLOOKUP(G$22,Dateneingabe!$C$12:$H$29,3,FALSE)),\"---\",VLOOKUP(G$22,Dateneingabe!$C$12:$H$29,6,FALSE))","v":"---"}]
["Gruppe","C1","C2","C3","C4","C5","C6"]
["ID (Startnr., Los, Klasse)",{"$f":"IF(ISERROR(VLOOKUP(B$22,Dateneingabe!$C$12:$E$29,2,FALSE)),\"---\",VLOOKUP(B$22,Dateneingabe!$C$12:$E$29,2,FALSE))","v":"---"},{"$f":"IF(ISERROR(VLOOKUP(C$22,Dateneingabe!$C$12:$E$29,2,FALSE)),\"---\",VLOOKUP(C$22,Dateneingabe!$C$12:$E$29,2,FALSE))","v":"---"},{"$f":"IF(ISERROR(VLOOKUP(D$22,Dateneingabe!$C$12:$E$29,2,FALSE)),\"---\",VLOOKUP(D$22,Dateneingabe!$C$12:$E$29,2,FALSE))","v":"---"},{"$f":"IF(ISERROR(VLOOKUP(E$22,Dateneingabe!$C$12:$E$29,2,FALSE)),\"---\",VLOOKUP(E$22,Dateneingabe!$C$12:$E$29,2,FALSE))","v":"---"},{"$f":"IF(ISERROR(VLOOKUP(F$22,Dateneingabe!$C$12:$E$29,2,FALSE)),\"---\",VLOOKUP(F$22,Dateneingabe!$C$12:$E$29,2,FALSE))","v":"---"},{"$f":"IF(ISERROR(VLOOKUP(G$22,Dateneingabe!$C$12:$E$29,2,FALSE)),\"---\",VLOOKUP(G$22,Dateneingabe!$C$12:$E$29,2,FALSE))","v":"---"}]
[{"$f":"'Übersicht Übungen'!$A$6&\". Übung: \n\"&'Übersicht Übungen'!$E$6","v":"1. Übung: \nVerhalten gegenüber anderen Hunden"}]
[{"$f":"'Übersicht Übungen'!$A$7&\". Übung: \n\"&'Übersicht Übungen'!$E$7","v":"2. Übung: \nStehen und Betasten"}]
[{"$f":"'Übersicht Übungen'!$A$8&\". Übung: \n\"&'Übersicht Übungen'!$E$8","v":"3. Übung: \n2 Minuten Liegen mit Sichtkontakt"}]
["OB1",{"$f":"IF(ISERROR(VLOOKUP(B$29,Dateneingabe!$C$32:$H$49,3,FALSE)),\"---\",VLOOKUP(B$29,Dateneingabe!$C$32:$H$49,3,FALSE))","v":"---"},{"$f":"IF(ISERROR(VLOOKUP(C$29,Dateneingabe!$C$32:$H$49,3,FALSE)),\"---\",VLOOKUP(C$29,Dateneingabe!$C$32:$H$49,3,FALSE))","v":"---"},{"$f":"IF(ISERROR(VLOOKUP(D$29,Dateneingabe!$C$32:$H$49,3,FALSE)),\"---\",VLOOKUP(D$29,Dateneingabe!$C$32:$H$49,3,FALSE))","v":"---"},{"$f":"IF(ISERROR(VLOOKUP(E$29,Dateneingabe!$C$32:$H$49,3,FALSE)),\"---\",VLOOKUP(E$29,Dateneingabe!$C$32:$H$49,3,FALSE))","v":"---"},{"$f":"IF(ISERROR(VLOOKUP(F$29,Dateneingabe!$C$32:$H$49,3,FALSE)),\"---\",VLOOKUP(F$29,Dateneingabe!$C$32:$H$49,3,FALSE))","v":"---"},{"$f":"IF(ISERROR(VLOOKUP(G$29,Dateneingabe!$C$32:$H$49,3,FALSE)),\"---\",VLOOKUP(G$29,Dateneingabe!$C$32:$H$49,3,FALSE))","v":"---"}]
[null,{"$f":"IF(ISERROR(VLOOKUP(B$29,Dateneingabe!$C$32:$H$49,3,FALSE)),\"---\",VLOOKUP(B$29,Dateneingabe!$C$32:$H$49,6,FALSE))","v":"---"},{"$f":"IF(ISERROR(VLOOKUP(C$29,Dateneingabe!$C$32:$H$49,3,FALSE)),\"---\",VLOOKUP(C$29,Dateneingabe!$C$32:$H$49,6,FALSE))","v":"---"},{"$f":"IF(ISERROR(VLOOKUP(D$29,Dateneingabe!$C$32:$H$49,3,FALSE)),\"---\",VLOOKUP(D$29,Dateneingabe!$C$32:$H$49,6,FALSE))","v":"---"},{"$f":"IF(ISERROR(VLOOKUP(E$29,Dateneingabe!$C$32:$H$49,3,FALSE)),\"---\",VLOOKUP(E$29,Dateneingabe!$C$32:$H$49,6,FALSE))","v":"---"},{"$f":"IF(ISERROR(VLOOKUP(F$29,Dateneingabe!$C$32:$H$49,3,FALSE)),\"---\",VLOOKUP(F$29,Dateneingabe!$C$32:$H$49,6,FALSE))","v":"---"},{"$f":"IF(ISERROR(VLOOKUP(G$29,Dateneingabe!$C$32:$H$49,3,FALSE)),\"---\",VLOOKUP(G$29,Dateneingabe!$C$32:$H$49,6,FALSE))","v":"---"}]
["Gruppe","D1","D2","D3","D4","D5","D6"]
["ID (Startnr., Los, Klasse)",{"$f":"IF(ISERROR(VLOOKUP(B$29,Dateneingabe!$C$32:$E$49,2,FALSE)),\"---\",VLOOKUP(B$29,Dateneingabe!$C$32:$E$49,2,FALSE))","v":"---"},{"$f":"IF(ISERROR(VLOOKUP(C$29,Dateneingabe!$C$32:$E$49,2,FALSE)),\"---\",VLOOKUP(C$29,Dateneingabe!$C$32:$E$49,2,FALSE))","v":"---"},{"$f":"IF(ISERROR(VLOOKUP(D$29,Dateneingabe!$C$32:$E$49,2,FALSE)),\"---\",VLOOKUP(D$29,Dateneingabe!$C$32:$E$49,2,FALSE))","v":"---"},{"$f":"IF(ISERROR(VLOOKUP(E$29,Dateneingabe!$C$32:$E$49,2,FALSE)),\"---\",VLOOKUP(E$29,Dateneingabe!$C$32:$E$49,2,FALSE))","v":"---"},{"$f":"IF(ISERROR(VLOOKUP(F$29,Dateneingabe!$C$32:$E$49,2,FALSE)),\"---\",VLOOKUP(F$29,Dateneingabe!$C$32:$E$49,2,FALSE))","v":"---"},{"$f":"IF(ISERROR(VLOOKUP(G$29,Dateneingabe!$C$32:$E$49,2,FALSE)),\"---\",VLOOKUP(G$29,Dateneingabe!$C$32:$E$49,2,FALSE))","v":"---"}]
[{"$f":"'Übersicht Übungen'!$A$20&\". Übung: \n\"&'Übersicht Übungen'!$E$20","v":"1. Übung: \n1 Minute Sitzen in einer Gruppe, Hundeführer in Sicht"}]
[]
[]
["OB1",{"$f":"IF(ISERROR(VLOOKUP(B$36,Dateneingabe!$C$32:$H$49,3,FALSE)),\"---\",VLOOKUP(B$36,Dateneingabe!$C$32:$H$49,3,FALSE))","v":"---"},{"$f":"IF(ISERROR(VLOOKUP(C$36,Dateneingabe!$C$32:$H$49,3,FALSE)),\"---\",VLOOKUP(C$36,Dateneingabe!$C$32:$H$49,3,FALSE))","v":"---"},{"$f":"IF(ISERROR(VLOOKUP(D$36,Dateneingabe!$C$32:$H$49,3,FALSE)),\"---\",VLOOKUP(D$36,Dateneingabe!$C$32:$H$49,3,FALSE))","v":"---"},{"$f":"IF(ISERROR(VLOOKUP(E$36,Dateneingabe!$C$32:$H$49,3,FALSE)),\"---\",VLOOKUP(E$36,Dateneingabe!$C$32:$H$49,3,FALSE))","v":"---"},{"$f":"IF(ISERROR(VLOOKUP(F$36,Dateneingabe!$C$32:$H$49,3,FALSE)),\"---\",VLOOKUP(F$36,Dateneingabe!$C$32:$H$49,3,FALSE))","v":"---"},{"$f":"IF(ISERROR(VLOOKUP(G$36,Dateneingabe!$C$32:$H$49,3,FALSE)),\"---\",VLOOKUP(G$36,Dateneingabe!$C$32:$H$49,3,FALSE))","v":"---"}]
[null,{"$f":"IF(ISERROR(VLOOKUP(B$36,Dateneingabe!$C$32:$H$49,3,FALSE)),\"---\",VLOOKUP(B$36,Dateneingabe!$C$32:$H$49,6,FALSE))","v":"---"},{"$f":"IF(ISERROR(VLOOKUP(C$36,Dateneingabe!$C$32:$H$49,3,FALSE)),\"---\",VLOOKUP(C$36,Dateneingabe!$C$32:$H$49,6,FALSE))","v":"---"},{"$f":"IF(ISERROR(VLOOKUP(D$36,Dateneingabe!$C$32:$H$49,3,FALSE)),\"---\",VLOOKUP(D$36,Dateneingabe!$C$32:$H$49,6,FALSE))","v":"---"},{"$f":"IF(ISERROR(VLOOKUP(E$36,Dateneingabe!$C$32:$H$49,3,FALSE)),\"---\",VLOOKUP(E$36,Dateneingabe!$C$32:$H$49,6,FALSE))","v":"---"},{"$f":"IF(ISERROR(VLOOKUP(F$36,Dateneingabe!$C$32:$H$49,3,FALSE)),\"---\",VLOOKUP(F$36,Dateneingabe!$C$32:$H$49,6,FALSE))","v":"---"},{"$f":"IF(ISERROR(VLOOKUP(G$36,Dateneingabe!$C$32:$H$49,3,FALSE)),\"---\",VLOOKUP(G$36,Dateneingabe!$C$32:$H$49,6,FALSE))","v":"---"}]
["Gruppe","E1","E2","E3","E4","E5","E6"]
["ID (Startnr., Los, Klasse)",{"$f":"IF(ISERROR(VLOOKUP(B$36,Dateneingabe!$C$32:$E$49,2,FALSE)),\"---\",VLOOKUP(B$36,Dateneingabe!$C$32:$E$49,2,FALSE))","v":"---"},{"$f":"IF(ISERROR(VLOOKUP(C$36,Dateneingabe!$C$32:$E$49,2,FALSE)),\"---\",VLOOKUP(C$36,Dateneingabe!$C$32:$E$49,2,FALSE))","v":"---"},{"$f":"IF(ISERROR(VLOOKUP(D$36,Dateneingabe!$C$32:$E$49,2,FALSE)),\"---\",VLOOKUP(D$36,Dateneingabe!$C$32:$E$49,2,FALSE))","v":"---"},{"$f":"IF(ISERROR(VLOOKUP(E$36,Dateneingabe!$C$32:$E$49,2,FALSE)),\"---\",VLOOKUP(E$36,Dateneingabe!$C$32:$E$49,2,FALSE))","v":"---"},{"$f":"IF(ISERROR(VLOOKUP(F$36,Dateneingabe!$C$32:$E$49,2,FALSE)),\"---\",VLOOKUP(F$36,Dateneingabe!$C$32:$E$49,2,FALSE))","v":"---"},{"$f":"IF(ISERROR(VLOOKUP(G$36,Dateneingabe!$C$32:$E$49,2,FALSE)),\"---\",VLOOKUP(G$36,Dateneingabe!$C$32:$E$49,2,FALSE))","v":"---"}]
[{"$f":"'Übersicht Übungen'!$A$20&\". Übung: \n\"&'Übersicht Übungen'!$E$20","v":"1. Übung: \n1 Minute Sitzen in einer Gruppe, Hundeführer in Sicht"}]
[]
[]
["OB1",{"$f":"IF(ISERROR(VLOOKUP(B$43,Dateneingabe!$C$32:$H$49,3,FALSE)),\"---\",VLOOKUP(B$43,Dateneingabe!$C$32:$H$49,3,FALSE))","v":"---"},{"$f":"IF(ISERROR(VLOOKUP(C$43,Dateneingabe!$C$32:$H$49,3,FALSE)),\"---\",VLOOKUP(C$43,Dateneingabe!$C$32:$H$49,3,FALSE))","v":"---"},{"$f":"IF(ISERROR(VLOOKUP(D$43,Dateneingabe!$C$32:$H$49,3,FALSE)),\"---\",VLOOKUP(D$43,Dateneingabe!$C$32:$H$49,3,FALSE))","v":"---"},{"$f":"IF(ISERROR(VLOOKUP(E$43,Dateneingabe!$C$32:$H$49,3,FALSE)),\"---\",VLOOKUP(E$43,Dateneingabe!$C$32:$H$49,3,FALSE))","v":"---"},{"$f":"IF(ISERROR(VLOOKUP(F$43,Dateneingabe!$C$32:$H$49,3,FALSE)),\"---\",VLOOKUP(F$43,Dateneingabe!$C$32:$H$49,3,FALSE))","v":"---"},{"$f":"IF(ISERROR(VLOOKUP(G$43,Dateneingabe!$C$32:$H$49,3,FALSE)),\"---\",VLOOKUP(G$43,Dateneingabe!$C$32:$H$49,3,FALSE))","v":"---"}]
[null,{"$f":"IF(ISERROR(VLOOKUP(B$43,Dateneingabe!$C$32:$H$49,3,FALSE)),\"---\",VLOOKUP(B$43,Dateneingabe!$C$32:$H$49,6,FALSE))","v":"---"},{"$f":"IF(ISERROR(VLOOKUP(C$43,Dateneingabe!$C$32:$H$49,3,FALSE)),\"---\",VLOOKUP(C$43,Dateneingabe!$C$32:$H$49,6,FALSE))","v":"---"},{"$f":"IF(ISERROR(VLOOKUP(D$43,Dateneingabe!$C$32:$H$49,3,FALSE)),\"---\",VLOOKUP(D$43,Dateneingabe!$C$32:$H$49,6,FALSE))","v":"---"},{"$f":"IF(ISERROR(VLOOKUP(E$43,Dateneingabe!$C$32:$H$49,3,FALSE)),\"---\",VLOOKUP(E$43,Dateneingabe!$C$32:$H$49,6,FALSE))","v":"---"},{"$f":"IF(ISERROR(VLOOKUP(F$43,Dateneingabe!$C$32:$H$49,3,FALSE)),\"---\",VLOOKUP(F$43,Dateneingabe!$C$32:$H$49,6,FALSE))","v":"---"},{"$f":"IF(ISERROR(VLOOKUP(G$43,Dateneingabe!$C$32:$H$49,3,FALSE)),\"---\",VLOOKUP(G$43,Dateneingabe!$C$32:$H$49,6,FALSE))","v":"---"}]
["Gruppe","F1","F2","F3","F4","F5","F6"]
["ID (Startnr., Los, Klasse)",{"$f":"IF(ISERROR(VLOOKUP(B$43,Dateneingabe!$C$32:$E$49,2,FALSE)),\"---\",VLOOKUP(B$43,Dateneingabe!$C$32:$E$49,2,FALSE))","v":"---"},{"$f":"IF(ISERROR(VLOOKUP(C$43,Dateneingabe!$C$32:$E$49,2,FALSE)),\"---\",VLOOKUP(C$43,Dateneingabe!$C$32:$E$49,2,FALSE))","v":"---"},{"$f":"IF(ISERROR(VLOOKUP(D$43,Dateneingabe!$C$32:$E$49,2,FALSE)),\"---\",VLOOKUP(D$43,Dateneingabe!$C$32:$E$49,2,FALSE))","v":"---"},{"$f":"IF(ISERROR(VLOOKUP(E$43,Dateneingabe!$C$32:$E$49,2,FALSE)),\"---\",VLOOKUP(E$43,Dateneingabe!$C$32:$E$49,2,FALSE))","v":"---"},{"$f":"IF(ISERROR(VLOOKUP(F$43,Dateneingabe!$C$32:$E$49,2,FALSE)),\"---\",VLOOKUP(F$43,Dateneingabe!$C$32:$E$49,2,FALSE))","v":"---"},{"$f":"IF(ISERROR(VLOOKUP(G$43,Dateneingabe!$C$32:$E$49,2,FALSE)),\"---\",VLOOKUP(G$43,Dateneingabe!$C$32:$E$49,2,FALSE))","v":"---"}]
[{"$f":"'Übersicht Übungen'!$A$20&\". Übung: \n\"&'Übersicht Übungen'!$E$20","v":"1. Übung: \n1 Minute Sitzen in einer Gruppe, Hundeführer in Sicht"}]
[]
[]
["OB2",{"$f":"IF(ISERROR(VLOOKUP(B$50,Dateneingabe!$C$52:$H$69,3,FALSE)),\"---\",VLOOKUP(B$50,Dateneingabe!$C$52:$H$69,3,FALSE))","v":"---"},{"$f":"IF(ISERROR(VLOOKUP(C$50,Dateneingabe!$C$52:$H$69,3,FALSE)),\"---\",VLOOKUP(C$50,Dateneingabe!$C$52:$H$69,3,FALSE))","v":"---"},{"$f":"IF(ISERROR(VLOOKUP(D$50,Dateneingabe!$C$52:$H$69,3,FALSE)),\"---\",VLOOKUP(D$50,Dateneingabe!$C$52:$H$69,3,FALSE))","v":"---"},{"$f":"IF(ISERROR(VLOOKUP(E$50,Dateneingabe!$C$52:$H$69,3,FALSE)),\"---\",VLOOKUP(E$50,Dateneingabe!$C$52:$H$69,3,FALSE))","v":"---"},{"$f":"IF(ISERROR(VLOOKUP(F$50,Dateneingabe!$C$52:$H$69,3,FALSE)),\"---\",VLOOKUP(F$50,Dateneingabe!$C$52:$H$69,3,FALSE))","v":"---"},{"$f":"IF(ISERROR(VLOOKUP(G$50,Dateneingabe!$C$52:$H$69,3,FALSE)),\"---\",VLOOKUP(G$50,Dateneingabe!$C$52:$H$69,3,FALSE))","v":"---"}]
[null,{"$f":"IF(ISERROR(VLOOKUP(B$50,Dateneingabe!$C$52:$H$69,3,FALSE)),\"---\",VLOOKUP(B$50,Dateneingabe!$C$52:$H$69,6,FALSE))","v":"---"},{"$f":"IF(ISERROR(VLOOKUP(C$50,Dateneingabe!$C$52:$H$69,3,FALSE)),\"---\",VLOOKUP(C$50,Dateneingabe!$C$52:$H$69,6,FALSE))","v":"---"},{"$f":"IF(ISERROR(VLOOKUP(D$50,Dateneingabe!$C$52:$H$69,3,FALSE)),\"---\",VLOOKUP(D$50,Dateneingabe!$C$52:$H$69,6,FALSE))","v":"---"},{"$f":"IF(ISERROR(VLOOKUP(E$50,Dateneingabe!$C$52:$H$69,3,FALSE)),\"---\",VLOOKUP(E$50,Dateneingabe!$C$52:$H$69,6,FALSE))","v":"---"},{"$f":"IF(ISERROR(VLOOKUP(F$50,Dateneingabe!$C$52:$H$69,3,FALSE)),\"---\",VLOOKUP(F$50,Dateneingabe!$C$52:$H$69,6,FALSE))","v":"---"},{"$f":"IF(ISERROR(VLOOKUP(G$50,Dateneingabe!$C$52:$H$69,3,FALSE)),\"---\",VLOOKUP(G$50,Dateneingabe!$C$52:$H$69,6,FALSE))","v":"---"}]
["Gruppe","G1","G2","G3","G4","G5","G6"]
["ID (Startnr., Los, Klasse)",{"$f":"IF(ISERROR(VLOOKUP(B$50,Dateneingabe!$C$52:$E$69,2,FALSE)),\"---\",VLOOKUP(B$50,Dateneingabe!$C$52:$E$69,2,FALSE))","v":"---"},{"$f":"IF(ISERROR(VLOOKUP(C$50,Dateneingabe!$C$52:$E$69,2,FALSE)),\"---\",VLOOKUP(C$50,Dateneingabe!$C$52:$E$69,2,FALSE))","v":"---"},{"$f":"IF(ISERROR(VLOOKUP(D$50,Dateneingabe!$C$52:$E$69,2,FALSE)),\"---\",VLOOKUP(D$50,Dateneingabe!$C$52:$E$69,2,FALSE))","v":"---"},{"$f":"IF(ISERROR(VLOOKUP(E$50,Dateneingabe!$C$52:$E$69,2,FALSE)),\"---\",VLOOKUP(E$50,Dateneingabe!$C$52:$E$69,2,FALSE))","v":"---"},{"$f":"IF(ISERROR(VLOOKUP(F$50,Dateneingabe!$C$52:$E$69,2,FALSE)),\"---\",VLOOKUP(F$50,Dateneingabe!$C$52:$E$69,2,FALSE))","v":"---"},{"$f":"IF(ISERROR(VLOOKUP(G$50,Dateneingabe!$C$52:$E$69,2,FALSE)),\"---\",VLOOKUP(G$50,Dateneingabe!$C$52:$E$69,2,FALSE))","v":"---"}]
[{"$f":"'Übersicht Übungen'!$A$34&\". Übung: \n\"&'Übersicht Übungen'!$E$34","v":"1. Übung: \n2 Minuten Liegen in einer Gruppe, Hundeführer außer Sicht"}]
[]
[]
["OB2",{"$f":"IF(ISERROR(VLOOKUP(B$57,Dateneingabe!$C$52:$H$69,3,FALSE)),\"---\",VLOOKUP(B$57,Dateneingabe!$C$52:$H$69,3,FALSE))","v":"---"},{"$f":"IF(ISERROR(VLOOKUP(C$57,Dateneingabe!$C$52:$H$69,3,FALSE)),\"---\",VLOOKUP(C$57,Dateneingabe!$C$52:$H$69,3,FALSE))","v":"---"},{"$f":"IF(ISERROR(VLOOKUP(D$57,Dateneingabe!$C$52:$H$69,3,FALSE)),\"---\",VLOOKUP(D$57,Dateneingabe!$C$52:$H$69,3,FALSE))","v":"---"},{"$f":"IF(ISERROR(VLOOKUP(E$57,Dateneingabe!$C$52:$H$69,3,FALSE)),\"---\",VLOOKUP(E$57,Dateneingabe!$C$52:$H$69,3,FALSE))","v":"---"},{"$f":"IF(ISERROR(VLOOKUP(F$57,Dateneingabe!$C$52:$H$69,3,FALSE)),\"---\",VLOOKUP(F$57,Dateneingabe!$C$52:$H$69,3,FALSE))","v":"---"},{"$f":"IF(ISERROR(VLOOKUP(G$57,Dateneingabe!$C$52:$H$69,3,FALSE)),\"---\",VLOOKUP(G$57,Dateneingabe!$C$52:$H$69,3,FALSE))","v":"---"}]
[null,{"$f":"IF(ISERROR(VLOOKUP(B$57,Dateneingabe!$C$52:$H$69,3,FALSE)),\"---\",VLOOKUP(B$57,Dateneingabe!$C$52:$H$69,6,FALSE))","v":"---"},{"$f":"IF(ISERROR(VLOOKUP(C$57,Dateneingabe!$C$52:$H$69,3,FALSE)),\"---\",VLOOKUP(C$57,Dateneingabe!$C$52:$H$69,6,FALSE))","v":"---"},{"$f":"IF(ISERROR(VLOOKUP(D$57,Dateneingabe!$C$52:$H$69,3,FALSE)),\"---\",VLOOKUP(D$57,Dateneingabe!$C$52:$H$69,6,FALSE))","v":"---"},{"$f":"IF(ISERROR(VLOOKUP(E$57,Dateneingabe!$C$52:$H$69,3,FALSE)),\"---\",VLOOKUP(E$57,Dateneingabe!$C$52:$H$69,6,FALSE))","v":"---"},{"$f":"IF(ISERROR(VLOOKUP(F$57,Dateneingabe!$C$52:$H$69,3,FALSE)),\"---\",VLOOKUP(F$57,Dateneingabe!$C$52:$H$69,6,FALSE))","v":"---"},{"$f":"IF(ISERROR(VLOOKUP(G$57,Dateneingabe!$C$52:$H$69,3,FALSE)),\"---\",VLOOKUP(G$57,Dateneingabe!$C$52:$H$69,6,FALSE))","v":"---"}]
["Gruppe","H1","H2","H3","H4","H5","H6"]
["ID (Startnr., Los, Klasse)",{"$f":"IF(ISERROR(VLOOKUP(B$57,Dateneingabe!$C$52:$E$69,2,FALSE)),\"---\",VLOOKUP(B$57,Dateneingabe!$C$52:$E$69,2,FALSE))","v":"---"},{"$f":"IF(ISERROR(VLOOKUP(C$57,Dateneingabe!$C$52:$E$69,2,FALSE)),\"---\",VLOOKUP(C$57,Dateneingabe!$C$52:$E$69,2,FALSE))","v":"---"},{"$f":"IF(ISERROR(VLOOKUP(D$57,Dateneingabe!$C$52:$E$69,2,FALSE)),\"---\",VLOOKUP(D$57,Dateneingabe!$C$52:$E$69,2,FALSE))","v":"---"},{"$f":"IF(ISERROR(VLOOKUP(E$57,Dateneingabe!$C$52:$E$69,2,FALSE)),\"---\",VLOOKUP(E$57,Dateneingabe!$C$52:$E$69,2,FALSE))","v":"---"},{"$f":"IF(ISERROR(VLOOKUP(F$57,Dateneingabe!$C$52:$E$69,2,FALSE)),\"---\",VLOOKUP(F$57,Dateneingabe!$C$52:$E$69,2,FALSE))","v":"---"},{"$f":"IF(ISERROR(VLOOKUP(G$57,Dateneingabe!$C$52:$E$69,2,FALSE)),\"---\",VLOOKUP(G$57,Dateneingabe!$C$52:$E$69,2,FALSE))","v":"---"}]
[{"$f":"'Übersicht Übungen'!$A$34&\". Übung: \n\"&'Übersicht Übungen'!$E$34","v":"1. Übung: \n2 Minuten Liegen in einer Gruppe, Hundeführer außer Sicht"}]
[]
[]
["OB2",{"$f":"IF(ISERROR(VLOOKUP(B$64,Dateneingabe!$C$52:$H$69,3,FALSE)),\"---\",VLOOKUP(B$64,Dateneingabe!$C$52:$H$69,3,FALSE))","v":"---"},{"$f":"IF(ISERROR(VLOOKUP(C$64,Dateneingabe!$C$52:$H$69,3,FALSE)),\"---\",VLOOKUP(C$64,Dateneingabe!$C$52:$H$69,3,FALSE))","v":"---"},{"$f":"IF(ISERROR(VLOOKUP(D$64,Dateneingabe!$C$52:$H$69,3,FALSE)),\"---\",VLOOKUP(D$64,Dateneingabe!$C$52:$H$69,3,FALSE))","v":"---"},{"$f":"IF(ISERROR(VLOOKUP(E$64,Dateneingabe!$C$52:$H$69,3,FALSE)),\"---\",VLOOKUP(E$64,Dateneingabe!$C$52:$H$69,3,FALSE))","v":"---"},{"$f":"IF(ISERROR(VLOOKUP(F$64,Dateneingabe!$C$52:$H$69,3,FALSE)),\"---\",VLOOKUP(F$64,Dateneingabe!$C$52:$H$69,3,FALSE))","v":"---"},{"$f":"IF(ISERROR(VLOOKUP(G$64,Dateneingabe!$C$52:$H$69,3,FALSE)),\"---\",VLOOKUP(G$64,Dateneingabe!$C$52:$H$69,3,FALSE))","v":"---"}]
[null,{"$f":"IF(ISERROR(VLOOKUP(B$64,Dateneingabe!$C$52:$H$69,3,FALSE)),\"---\",VLOOKUP(B$64,Dateneingabe!$C$52:$H$69,6,FALSE))","v":"---"},{"$f":"IF(ISERROR(VLOOKUP(C$64,Dateneingabe!$C$52:$H$69,3,FALSE)),\"---\",VLOOKUP(C$64,Dateneingabe!$C$52:$H$69,6,FALSE))","v":"---"},{"$f":"IF(ISERROR(VLOOKUP(D$64,Dateneingabe!$C$52:$H$69,3,FALSE)),\"---\",VLOOKUP(D$64,Dateneingabe!$C$52:$H$69,6,FALSE))","v":"---"},{"$f":"IF(ISERROR(VLOOKUP(E$64,Dateneingabe!$C$52:$H$69,3,FALSE)),\"---\",VLOOKUP(E$64,Dateneingabe!$C$52:$H$69,6,FALSE))","v":"---"},{"$f":"IF(ISERROR(VLOOKUP(F$64,Dateneingabe!$C$52:$H$69,3,FALSE)),\"---\",VLOOKUP(F$64,Dateneingabe!$C$52:$H$69,6,FALSE))","v":"---"},{"$f":"IF(ISERROR(VLOOKUP(G$64,Dateneingabe!$C$52:$H$69,3,FALSE)),\"---\",VLOOKUP(G$64,Dateneingabe!$C$52:$H$69,6,FALSE))","v":"---"}]
["Gruppe","I1","I2","I3","I4","I5","I6"]
["ID (Startnr., Los, Klasse)",{"$f":"IF(ISERROR(VLOOKUP(B$64,Dateneingabe!$C$52:$E$69,2,FALSE)),\"---\",VLOOKUP(B$64,Dateneingabe!$C$52:$E$69,2,FALSE))","v":"---"},{"$f":"IF(ISERROR(VLOOKUP(C$64,Dateneingabe!$C$52:$E$69,2,FALSE)),\"---\",VLOOKUP(C$64,Dateneingabe!$C$52:$E$69,2,FALSE))","v":"---"},{"$f":"IF(ISERROR(VLOOKUP(D$64,Dateneingabe!$C$52:$E$69,2,FALSE)),\"---\",VLOOKUP(D$64,Dateneingabe!$C$52:$E$69,2,FALSE))","v":"---"},{"$f":"IF(ISERROR(VLOOKUP(E$64,Dateneingabe!$C$52:$E$69,2,FALSE)),\"---\",VLOOKUP(E$64,Dateneingabe!$C$52:$E$69,2,FALSE))","v":"---"},{"$f":"IF(ISERROR(VLOOKUP(F$64,Dateneingabe!$C$52:$E$69,2,FALSE)),\"---\",VLOOKUP(F$64,Dateneingabe!$C$52:$E$69,2,FALSE))","v":"---"},{"$f":"IF(ISERROR(VLOOKUP(G$64,Dateneingabe!$C$52:$E$69,2,FALSE)),\"---\",VLOOKUP(G$64,Dateneingabe!$C$52:$E$69,2,FALSE))","v":"---"}]
[{"$f":"'Übersicht Übungen'!$A$34&\". Übung: \n\"&'Übersicht Übungen'!$E$34","v":"1. Übung: \n2 Minuten Liegen in einer Gruppe, Hundeführer außer Sicht"}]
[]
[]
["OB3",{"$f":"IF(ISERROR(VLOOKUP(B$71,Dateneingabe!$C$72:$H$109,3,FALSE)),\"---\",VLOOKUP(B$71,Dateneingabe!$C$72:$H$109,3,FALSE))","v":"---"},{"$f":"IF(ISERROR(VLOOKUP(C$71,Dateneingabe!$C$72:$H$109,3,FALSE)),\"---\",VLOOKUP(C$71,Dateneingabe!$C$72:$H$109,3,FALSE))","v":"---"},{"$f":"IF(ISERROR(VLOOKUP(D$71,Dateneingabe!$C$72:$H$109,3,FALSE)),\"---\",VLOOKUP(D$71,Dateneingabe!$C$72:$H$109,3,FALSE))","v":"---"},{"$f":"IF(ISERROR(VLOOKUP(E$71,Dateneingabe!$C$72:$H$109,3,FALSE)),\"---\",VLOOKUP(E$71,Dateneingabe!$C$72:$H$109,3,FALSE))","v":"---"},{"$f":"IF(ISERROR(VLOOKUP(F$71,Dateneingabe!$C$72:$H$109,3,FALSE)),\"---\",VLOOKUP(F$71,Dateneingabe!$C$72:$H$109,3,FALSE))","v":"---"},{"$f":"IF(ISERROR(VLOOKUP(G$71,Dateneingabe!$C$72:$H$109,3,FALSE)),\"---\",VLOOKUP(G$71,Dateneingabe!$C$72:$H$109,3,FALSE))","v":"---"}]
[null,{"$f":"IF(ISERROR(VLOOKUP(B$71,Dateneingabe!$C$72:$H$109,3,FALSE)),\"---\",VLOOKUP(B$71,Dateneingabe!$C$72:$H$109,6,FALSE))","v":"---"},{"$f":"IF(ISERROR(VLOOKUP(C$71,Dateneingabe!$C$72:$H$109,3,FALSE)),\"---\",VLOOKUP(C$71,Dateneingabe!$C$72:$H$109,6,FALSE))","v":"---"},{"$f":"IF(ISERROR(VLOOKUP(D$71,Dateneingabe!$C$72:$H$109,3,FALSE)),\"---\",VLOOKUP(D$71,Dateneingabe!$C$72:$H$109,6,FALSE))","v":"---"},{"$f":"IF(ISERROR(VLOOKUP(E$71,Dateneingabe!$C$72:$H$109,3,FALSE)),\"---\",VLOOKUP(E$71,Dateneingabe!$C$72:$H$109,6,FALSE))","v":"---"},{"$f":"IF(ISERROR(VLOOKUP(F$71,Dateneingabe!$C$72:$H$109,3,FALSE)),\"---\",VLOOKUP(F$71,Dateneingabe!$C$72:$H$109,6,FALSE))","v":"---"},{"$f":"IF(ISERROR(VLOOKUP(G$71,Dateneingabe!$C$72:$H$109,3,FALSE)),\"---\",VLOOKUP(G$71,Dateneingabe!$C$72:$H$109,6,FALSE))","v":"---"}]
["Gruppe","J1","J2","J3","J4","J5","J6"]
["ID (Startnr., Los, Klasse)",{"$f":"IF(ISERROR(VLOOKUP(B$71,Dateneingabe!$C$72:$E$109,2,FALSE)),\"---\",VLOOKUP(B$71,Dateneingabe!$C$72:$E$109,2,FALSE))","v":"---"},{"$f":"IF(ISERROR(VLOOKUP(C$71,Dateneingabe!$C$72:$E$109,2,FALSE)),\"---\",VLOOKUP(C$71,Dateneingabe!$C$72:$E$109,2,FALSE))","v":"---"},{"$f":"IF(ISERROR(VLOOKUP(D$71,Dateneingabe!$C$72:$E$109,2,FALSE)),\"---\",VLOOKUP(D$71,Dateneingabe!$C$72:$E$109,2,FALSE))","v":"---"},{"$f":"IF(ISERROR(VLOOKUP(E$71,Dateneingabe!$C$72:$E$109,2,FALSE)),\"---\",VLOOKUP(E$71,Dateneingabe!$C$72:$E$109,2,FALSE))","v":"---"},{"$f":"IF(ISERROR(VLOOKUP(F$71,Dateneingabe!$C$72:$E$109,2,FALSE)),\"---\",VLOOKUP(F$71,Dateneingabe!$C$72:$E$109,2,FALSE))","v":"---"},{"$f":"IF(ISERROR(VLOOKUP(G$71,Dateneingabe!$C$72:$E$109,2,FALSE)),\"---\",VLOOKUP(G$71,Dateneingabe!$C$72:$E$109,2,FALSE))","v":"---"}]
[{"$f":"'Übersicht Übungen'!$A$48&\". Übung: \n\"&'Übersicht Übungen'!$E$48","v":"1. Übung: \n2 Minuten Sitzen in der Gruppe außer Sicht"}]
[{"$f":"'Übersicht Übungen'!$A$49&\". Übung: \n\"&'Übersicht Übungen'!$E$49","v":"2. Übung: \n1 Minute Liegen in der Gruppe mit Abrufen"}]
[]
["OB3",{"$f":"IF(ISERROR(VLOOKUP(B$78,Dateneingabe!$C$72:$H$109,3,FALSE)),\"---\",VLOOKUP(B$78,Dateneingabe!$C$72:$H$109,3,FALSE))","v":"---"},{"$f":"IF(ISERROR(VLOOKUP(C$78,Dateneingabe!$C$72:$H$109,3,FALSE)),\"---\",VLOOKUP(C$78,Dateneingabe!$C$72:$H$109,3,FALSE))","v":"---"},{"$f":"IF(ISERROR(VLOOKUP(D$78,Dateneingabe!$C$72:$H$109,3,FALSE)),\"---\",VLOOKUP(D$78,Dateneingabe!$C$72:$H$109,3,FALSE))","v":"---"},{"$f":"IF(ISERROR(VLOOKUP(E$78,Dateneingabe!$C$72:$H$109,3,FALSE)),\"---\",VLOOKUP(E$78,Dateneingabe!$C$72:$H$109,3,FALSE))","v":"---"},{"$f":"IF(ISERROR(VLOOKUP(F$78,Dateneingabe!$C$72:$H$109,3,FALSE)),\"---\",VLOOKUP(F$78,Dateneingabe!$C$72:$H$109,3,FALSE))","v":"---"},{"$f":"IF(ISERROR(VLOOKUP(G$78,Dateneingabe!$C$72:$H$109,3,FALSE)),\"---\",VLOOKUP(G$78,Dateneingabe!$C$72:$H$109,3,FALSE))","v":"---"}]
[null,{"$f":"IF(ISERROR(VLOOKUP(B$78,Dateneingabe!$C$72:$H$109,3,FALSE)),\"---\",VLOOKUP(B$78,Dateneingabe!$C$72:$H$109,6,FALSE))","v":"---"},{"$f":"IF(ISERROR(VLOOKUP(C$78,Dateneingabe!$C$72:$H$109,3,FALSE)),\"---\",VLOOKUP(C$78,Dateneingabe!$C$72:$H$109,6,FALSE))","v":"---"},{"$f":"IF(ISERROR(VLOOKUP(D$78,Dateneingabe!$C$72:$H$109,3,FALSE)),\"---\",VLOOKUP(D$78,Dateneingabe!$C$72:$H$109,6,FALSE))","v":"---"},{"$f":"IF(ISERROR(VLOOKUP(E$78,Dateneingabe!$C$72:$H$109,3,FALSE)),\"---\",VLOOKUP(E$78,Dateneingabe!$C$72:$H$109,6,FALSE))","v":"---"},{"$f":"IF(ISERROR(VLOOKUP(F$78,Dateneingabe!$C$72:$H$109,3,FALSE)),\"---\",VLOOKUP(F$78,Dateneingabe!$C$72:$H$109,6,FALSE))","v":"---"},{"$f":"IF(ISERROR(VLOOKUP(G$78,Dateneingabe!$C$72:$H$109,3,FALSE)),\"---\",VLOOKUP(G$78,Dateneingabe!$C$72:$H$109,6,FALSE))","v":"---"}]
["Gruppe","K1","K2","K3","K4","K5","K6"]
["ID (Startnr., Los, Klasse)",{"$f":"IF(ISERROR(VLOOKUP(B$78,Dateneingabe!$C$72:$E$109,2,FALSE)),\"---\",VLOOKUP(B$78,Dateneingabe!$C$72:$E$109,2,FALSE))","v":"---"},{"$f":"IF(ISERROR(VLOOKUP(C$78,Dateneingabe!$C$72:$E$109,2,FALSE)),\"---\",VLOOKUP(C$78,Dateneingabe!$C$72:$E$109,2,FALSE))","v":"---"},{"$f":"IF(ISERROR(VLOOKUP(D$78,Dateneingabe!$C$72:$E$109,2,FALSE)),\"---\",VLOOKUP(D$78,Dateneingabe!$C$72:$E$109,2,FALSE))","v":"---"},{"$f":"IF(ISERROR(VLOOKUP(E$78,Dateneingabe!$C$72:$E$109,2,FALSE)),\"---\",VLOOKUP(E$78,Dateneingabe!$C$72:$E$109,2,FALSE))","v":"---"},{"$f":"IF(ISERROR(VLOOKUP(F$78,Dateneingabe!$C$72:$E$109,2,FALSE)),\"---\",VLOOKUP(F$78,Dateneingabe!$C$72:$E$109,2,FALSE))","v":"---"},{"$f":"IF(ISERROR(VLOOKUP(G$78,Dateneingabe!$C$72:$E$109,2,FALSE)),\"---\",VLOOKUP(G$78,Dateneingabe!$C$72:$E$109,2,FALSE))","v":"---"}]
[{"$f":"'Übersicht Übungen'!$A$48&\". Übung: \n\"&'Übersicht Übungen'!$E$48","v":"1. Übung: \n2 Minuten Sitzen in der Gruppe außer Sicht"}]
[{"$f":"'Übersicht Übungen'!$A$49&\". Übung: \n\"&'Übersicht Übungen'!$E$49","v":"2. Übung: \n1 Minute Liegen in der Gruppe mit Abrufen"}]
[]
["OB3",{"$f":"IF(ISERROR(VLOOKUP(B$85,Dateneingabe!$C$72:$H$109,3,FALSE)),\"---\",VLOOKUP(B$85,Dateneingabe!$C$72:$H$109,3,FALSE))","v":"---"},{"$f":"IF(ISERROR(VLOOKUP(C$85,Dateneingabe!$C$72:$H$109,3,FALSE)),\"---\",VLOOKUP(C$85,Dateneingabe!$C$72:$H$109,3,FALSE))","v":"---"},{"$f":"IF(ISERROR(VLOOKUP(D$85,Dateneingabe!$C$72:$H$109,3,FALSE)),\"---\",VLOOKUP(D$85,Dateneingabe!$C$72:$H$109,3,FALSE))","v":"---"},{"$f":"IF(ISERROR(VLOOKUP(E$85,Dateneingabe!$C$72:$H$109,3,FALSE)),\"---\",VLOOKUP(E$85,Dateneingabe!$C$72:$H$109,3,FALSE))","v":"---"},{"$f":"IF(ISERROR(VLOOKUP(F$85,Dateneingabe!$C$72:$H$109,3,FALSE)),\"---\",VLOOKUP(F$85,Dateneingabe!$C$72:$H$109,3,FALSE))","v":"---"},{"$f":"IF(ISERROR(VLOOKUP(G$85,Dateneingabe!$C$72:$H$109,3,FALSE)),\"---\",VLOOKUP(G$85,Dateneingabe!$C$72:$H$109,3,FALSE))","v":"---"}]
[null,{"$f":"IF(ISERROR(VLOOKUP(B$85,Dateneingabe!$C$72:$H$109,3,FALSE)),\"---\",VLOOKUP(B$85,Dateneingabe!$C$72:$H$109,6,FALSE))","v":"---"},{"$f":"IF(ISERROR(VLOOKUP(C$85,Dateneingabe!$C$72:$H$109,3,FALSE)),\"---\",VLOOKUP(C$85,Dateneingabe!$C$72:$H$109,6,FALSE))","v":"---"},{"$f":"IF(ISERROR(VLOOKUP(D$85,Dateneingabe!$C$72:$H$109,3,FALSE)),\"---\",VLOOKUP(D$85,Dateneingabe!$C$72:$H$109,6,FALSE))","v":"---"},{"$f":"IF(ISERROR(VLOOKUP(E$85,Dateneingabe!$C$72:$H$109,3,FALSE)),\"---\",VLOOKUP(E$85,Dateneingabe!$C$72:$H$109,6,FALSE))","v":"---"},{"$f":"IF(ISERROR(VLOOKUP(F$85,Dateneingabe!$C$72:$H$109,3,FALSE)),\"---\",VLOOKUP(F$85,Dateneingabe!$C$72:$H$109,6,FALSE))","v":"---"},{"$f":"IF(ISERROR(VLOOKUP(G$85,Dateneingabe!$C$72:$H$109,3,FALSE)),\"---\",VLOOKUP(G$85,Dateneingabe!$C$72:$H$109,6,FALSE))","v":"---"}]
["Gruppe","L1","L2","L3","L4","L5","L6"]
["ID (Startnr., Los, Klasse)",{"$f":"IF(ISERROR(VLOOKUP(B$85,Dateneingabe!$C$72:$E$109,2,FALSE)),\"---\",VLOOKUP(B$85,Dateneingabe!$C$72:$E$109,2,FALSE))","v":"---"},{"$f":"IF(ISERROR(VLOOKUP(C$85,Dateneingabe!$C$72:$E$109,2,FALSE)),\"---\",VLOOKUP(C$85,Dateneingabe!$C$72:$E$109,2,FALSE))","v":"---"},{"$f":"IF(ISERROR(VLOOKUP(D$85,Dateneingabe!$C$72:$E$109,2,FALSE)),\"---\",VLOOKUP(D$85,Dateneingabe!$C$72:$E$109,2,FALSE))","v":"---"},{"$f":"IF(ISERROR(VLOOKUP(E$85,Dateneingabe!$C$72:$E$109,2,FALSE)),\"---\",VLOOKUP(E$85,Dateneingabe!$C$72:$E$109,2,FALSE))","v":"---"},{"$f":"IF(ISERROR(VLOOKUP(F$85,Dateneingabe!$C$72:$E$109,2,FALSE)),\"---\",VLOOKUP(F$85,Dateneingabe!$C$72:$E$109,2,FALSE))","v":"---"},{"$f":"IF(ISERROR(VLOOKUP(G$85,Dateneingabe!$C$72:$E$109,2,FALSE)),\"---\",VLOOKUP(G$85,Dateneingabe!$C$72:$E$109,2,FALSE))","v":"---"}]
[{"$f":"'Übersicht Übungen'!$A$48&\". Übung: \n\"&'Übersicht Übungen'!$E$48","v":"1. Übung: \n2 Minuten Sitzen in der Gruppe außer Sicht"}]
[{"$f":"'Übersicht Übungen'!$A$49&\". Übung: \n\"&'Übersicht Übungen'!$E$49","v":"2. Übung: \n1 Minute Liegen in der Gruppe mit Abrufen"}]
[]
["OBS",{"$f":"IF(ISERROR(VLOOKUP(B$92,Dateneingabe!$C$92:$H$109,3,FALSE)),\"---\",VLOOKUP(B$92,Dateneingabe!$C$92:$H$109,3,FALSE))","v":"---"},{"$f":"IF(ISERROR(VLOOKUP(C$92,Dateneingabe!$C$92:$H$109,3,FALSE)),\"---\",VLOOKUP(C$92,Dateneingabe!$C$92:$H$109,3,FALSE))","v":"---"},{"$f":"IF(ISERROR(VLOOKUP(D$92,Dateneingabe!$C$92:$H$109,3,FALSE)),\"---\",VLOOKUP(D$92,Dateneingabe!$C$92:$H$109,3,FALSE))","v":"---"},{"$f":"IF(ISERROR(VLOOKUP(E$92,Dateneingabe!$C$92:$H$109,3,FALSE)),\"---\",VLOOKUP(E$92,Dateneingabe!$C$92:$H$109,3,FALSE))","v":"---"},{"$f":"IF(ISERROR(VLOOKUP(F$92,Dateneingabe!$C$92:$H$109,3,FALSE)),\"---\",VLOOKUP(F$92,Dateneingabe!$C$92:$H$109,3,FALSE))","v":"---"},{"$f":"IF(ISERROR(VLOOKUP(G$92,Dateneingabe!$C$92:$H$109,3,FALSE)),\"---\",VLOOKUP(G$92,Dateneingabe!$C$92:$H$109,3,FALSE))","v":"---"}]
[null,{"$f":"IF(ISERROR(VLOOKUP(B$92,Dateneingabe!$C$92:$H$109,3,FALSE)),\"---\",VLOOKUP(B$92,Dateneingabe!$C$92:$H$109,6,FALSE))","v":"---"},{"$f":"IF(ISERROR(VLOOKUP(C$92,Dateneingabe!$C$92:$H$109,3,FALSE)),\"---\",VLOOKUP(C$92,Dateneingabe!$C$92:$H$109,6,FALSE))","v":"---"},{"$f":"IF(ISERROR(VLOOKUP(D$92,Dateneingabe!$C$92:$H$109,3,FALSE)),\"---\",VLOOKUP(D$92,Dateneingabe!$C$92:$H$109,6,FALSE))","v":"---"},{"$f":"IF(ISERROR(VLOOKUP(E$92,Dateneingabe!$C$92:$H$109,3,FALSE)),\"---\",VLOOKUP(E$92,Dateneingabe!$C$92:$H$109,6,FALSE))","v":"---"},{"$f":"IF(ISERROR(VLOOKUP(F$92,Dateneingabe!$C$92:$H$109,3,FALSE)),\"---\",VLOOKUP(F$92,Dateneingabe!$C$92:$H$109,6,FALSE))","v":"---"},{"$f":"IF(ISERROR(VLOOKUP(G$92,Dateneingabe!$C$92:$H$109,3,FALSE)),\"---\",VLOOKUP(G$92,Dateneingabe!$C$92:$H$109,6,FALSE))","v":"---"}]
["Gruppe","M1","M2","M3","M4","M5","M6"]
["ID (Startnr., Los, Klasse)",{"$f":"IF(ISERROR(VLOOKUP(B$92,Dateneingabe!$C$92:$E$109,2,FALSE)),\"---\",VLOOKUP(B$92,Dateneingabe!$C$92:$E$109,2,FALSE))","v":"---"},{"$f":"IF(ISERROR(VLOOKUP(C$92,Dateneingabe!$C$92:$E$109,2,FALSE)),\"---\",VLOOKUP(C$92,Dateneingabe!$C$92:$E$109,2,FALSE))","v":"---"},{"$f":"IF(ISERROR(VLOOKUP(D$92,Dateneingabe!$C$92:$E$109,2,FALSE)),\"---\",VLOOKUP(D$92,Dateneingabe!$C$92:$E$109,2,FALSE))","v":"---"},{"$f":"IF(ISERROR(VLOOKUP(E$92,Dateneingabe!$C$92:$E$109,2,FALSE)),\"---\",VLOOKUP(E$92,Dateneingabe!$C$92:$E$109,2,FALSE))","v":"---"},{"$f":"IF(ISERROR(VLOOKUP(F$92,Dateneingabe!$C$92:$E$109,2,FALSE)),\"---\",VLOOKUP(F$92,Dateneingabe!$C$92:$E$109,2,FALSE))","v":"---"},{"$f":"IF(ISERROR(VLOOKUP(G$92,Dateneingabe!$C$92:$E$109,2,FALSE)),\"---\",VLOOKUP(G$92,Dateneingabe!$C$92:$E$109,2,FALSE))","v":"---"}]
[{"$f":"'Übersicht Übungen'!$A$62&\". Übung: \n\"&'Übersicht Übungen'!$E$62","v":"1. Übung: \n2 Minuten Liegen in einer Gruppe, Hundeführer außer Sicht"}]
[]
[]
["OBS",{"$f":"IF(ISERROR(VLOOKUP(B$99,Dateneingabe!$C$92:$H$109,3,FALSE)),\"---\",VLOOKUP(B$99,Dateneingabe!$C$92:$H$109,3,FALSE))","v":"---"},{"$f":"IF(ISERROR(VLOOKUP(C$99,Dateneingabe!$C$92:$H$109,3,FALSE)),\"---\",VLOOKUP(C$99,Dateneingabe!$C$92:$H$109,3,FALSE))","v":"---"},{"$f":"IF(ISERROR(VLOOKUP(D$99,Dateneingabe!$C$92:$H$109,3,FALSE)),\"---\",VLOOKUP(D$99,Dateneingabe!$C$92:$H$109,3,FALSE))","v":"---"},{"$f":"IF(ISERROR(VLOOKUP(E$99,Dateneingabe!$C$92:$H$109,3,FALSE)),\"---\",VLOOKUP(E$99,Dateneingabe!$C$92:$H$109,3,FALSE))","v":"---"},{"$f":"IF(ISERROR(VLOOKUP(F$99,Dateneingabe!$C$92:$H$109,3,FALSE)),\"---\",VLOOKUP(F$99,Dateneingabe!$C$92:$H$109,3,FALSE))","v":"---"},{"$f":"IF(ISERROR(VLOOKUP(G$99,Dateneingabe!$C$92:$H$109,3,FALSE)),\"---\",VLOOKUP(G$99,Dateneingabe!$C$92:$H$109,3,FALSE))","v":"---"}]
[null,{"$f":"IF(ISERROR(VLOOKUP(B$99,Dateneingabe!$C$92:$H$109,3,FALSE)),\"---\",VLOOKUP(B$99,Dateneingabe!$C$92:$H$109,6,FALSE))","v":"---"},{"$f":"IF(ISERROR(VLOOKUP(C$99,Dateneingabe!$C$92:$H$109,3,FALSE)),\"---\",VLOOKUP(C$99,Dateneingabe!$C$92:$H$109,6,FALSE))","v":"---"},{"$f":"IF(ISERROR(VLOOKUP(D$99,Dateneingabe!$C$92:$H$109,3,FALSE)),\"---\",VLOOKUP(D$99,Dateneingabe!$C$92:$H$109,6,FALSE))","v":"---"},{"$f":"IF(ISERROR(VLOOKUP(E$99,Dateneingabe!$C$92:$H$109,3,FALSE)),\"---\",VLOOKUP(E$99,Dateneingabe!$C$92:$H$109,6,FALSE))","v":"---"},{"$f":"IF(ISERROR(VLOOKUP(F$99,Dateneingabe!$C$92:$H$109,3,FALSE)),\"---\",VLOOKUP(F$99,Dateneingabe!$C$92:$H$109,6,FALSE))","v":"---"},{"$f":"IF(ISERROR(VLOOKUP(G$99,Dateneingabe!$C$92:$H$109,3,FALSE)),\"---\",VLOOKUP(G$99,Dateneingabe!$C$92:$H$109,6,FALSE))","v":"---"}]
["Gruppe","N1","N2","N3","N4","N5","N6"]
["ID (Startnr., Los, Klasse)",{"$f":"IF(ISERROR(VLOOKUP(B$99,Dateneingabe!$C$92:$E$109,2,FALSE)),\"---\",VLOOKUP(B$99,Dateneingabe!$C$92:$E$109,2,FALSE))","v":"---"},{"$f":"IF(ISERROR(VLOOKUP(C$99,Dateneingabe!$C$92:$E$109,2,FALSE)),\"---\",VLOOKUP(C$99,Dateneingabe!$C$92:$E$109,2,FALSE))","v":"---"},{"$f":"IF(ISERROR(VLOOKUP(D$99,Dateneingabe!$C$92:$E$109,2,FALSE)),\"---\",VLOOKUP(D$99,Dateneingabe!$C$92:$E$109,2,FALSE))","v":"---"},{"$f":"IF(ISERROR(VLOOKUP(E$99,Dateneingabe!$C$92:$E$109,2,FALSE)),\"---\",VLOOKUP(E$99,Dateneingabe!$C$92:$E$109,2,FALSE))","v":"---"},{"$f":"IF(ISERROR(VLOOKUP(F$99,Dateneingabe!$C$92:$E$109,2,FALSE)),\"---\",VLOOKUP(F$99,Dateneingabe!$C$92:$E$109,2,FALSE))","v":"---"},{"$f":"IF(ISERROR(VLOOKUP(G$99,Dateneingabe!$C$92:$E$109,2,FALSE)),\"---\",VLOOKUP(G$99,Dateneingabe!$C$92:$E$109,2,FALSE))","v":"---"}]
[{"$f":"'Übersicht Übungen'!$A$62&\". Übung: \n\"&'Übersicht Übungen'!$E$62","v":"1. Übung: \n2 Minuten Liegen in einer Gruppe, Hundeführer außer Sicht"}]
[]
[]
["OBS",{"$f":"IF(ISERROR(VLOOKUP(B$106,Dateneingabe!$C$92:$H$109,3,FALSE)),\"---\",VLOOKUP(B$106,Dateneingabe!$C$92:$H$109,3,FALSE))","v":"---"},{"$f":"IF(ISERROR(VLOOKUP(C$106,Dateneingabe!$C$92:$H$109,3,FALSE)),\"---\",VLOOKUP(C$106,Dateneingabe!$C$92:$H$109,3,FALSE))","v":"---"},{"$f":"IF(ISERROR(VLOOKUP(D$106,Dateneingabe!$C$92:$H$109,3,FALSE)),\"---\",VLOOKUP(D$106,Dateneingabe!$C$92:$H$109,3,FALSE))","v":"---"},{"$f":"IF(ISERROR(VLOOKUP(E$106,Dateneingabe!$C$92:$H$109,3,FALSE)),\"---\",VLOOKUP(E$106,Dateneingabe!$C$92:$H$109,3,FALSE))","v":"---"},{"$f":"IF(ISERROR(VLOOKUP(F$106,Dateneingabe!$C$92:$H$109,3,FALSE)),\"---\",VLOOKUP(F$106,Dateneingabe!$C$92:$H$109,3,FALSE))","v":"---"},{"$f":"IF(ISERROR(VLOOKUP(G$106,Dateneingabe!$C$92:$H$109,3,FALSE)),\"---\",VLOOKUP(G$106,Dateneingabe!$C$92:$H$109,3,FALSE))","v":"---"}]
[null,{"$f":"IF(ISERROR(VLOOKUP(B$106,Dateneingabe!$C$92:$H$109,3,FALSE)),\"---\",VLOOKUP(B$106,Dateneingabe!$C$92:$H$109,6,FALSE))","v":"---"},{"$f":"IF(ISERROR(VLOOKUP(C$106,Dateneingabe!$C$92:$H$109,3,FALSE)),\"---\",VLOOKUP(C$106,Dateneingabe!$C$92:$H$109,6,FALSE))","v":"---"},{"$f":"IF(ISERROR(VLOOKUP(D$106,Dateneingabe!$C$92:$H$109,3,FALSE)),\"---\",VLOOKUP(D$106,Dateneingabe!$C$92:$H$109,6,FALSE))","v":"---"},{"$f":"IF(ISERROR(VLOOKUP(E$106,Dateneingabe!$C$92:$H$109,3,FALSE)),\"---\",VLOOKUP(E$106,Dateneingabe!$C$92:$H$109,6,FALSE))","v":"---"},{"$f":"IF(ISERROR(VLOOKUP(F$106,Dateneingabe!$C$92:$H$109,3,FALSE)),\"---\",VLOOKUP(F$106,Dateneingabe!$C$92:$H$109,6,FALSE))","v":"---"},{"$f":"IF(ISERROR(VLOOKUP(G$106,Dateneingabe!$C$92:$H$109,3,FALSE)),\"---\",VLOOKUP(G$106,Dateneingabe!$C$92:$H$109,6,FALSE))","v":"---"}]
["Gruppe","O1","O2","O3","O4","O5","O6"]
["ID (Startnr., Los, Klasse)",{"$f":"IF(ISERROR(VLOOKUP(B$106,Dateneingabe!$C$92:$E$109,2,FALSE)),\"---\",VLOOKUP(B$106,Dateneingabe!$C$92:$E$109,2,FALSE))","v":"---"},{"$f":"IF(ISERROR(VLOOKUP(C$106,Dateneingabe!$C$92:$E$109,2,FALSE)),\"---\",VLOOKUP(C$106,Dateneingabe!$C$92:$E$109,2,FALSE))","v":"---"},{"$f":"IF(ISERROR(VLOOKUP(D$106,Dateneingabe!$C$92:$E$109,2,FALSE)),\"---\",VLOOKUP(D$106,Dateneingabe!$C$92:$E$109,2,FALSE))","v":"---"},{"$f":"IF(ISERROR(VLOOKUP(E$106,Dateneingabe!$C$92:$E$109,2,FALSE)),\"---\",VLOOKUP(E$106,Dateneingabe!$C$92:$E$109,2,FALSE))","v":"---"},{"$f":"IF(ISERROR(VLOOKUP(F$106,Dateneingabe!$C$92:$E$109,2,FALSE)),\"---\",VLOOKUP(F$106,Dateneingabe!$C$92:$E$109,2,FALSE))","v":"---"},{"$f":"IF(ISERROR(VLOOKUP(G$106,Dateneingabe!$C$92:$E$109,2,FALSE)),\"---\",VLOOKUP(G$106,Dateneingabe!$C$92:$E$109,2,FALSE))","v":"---"}]
[{"$f":"'Übersicht Übungen'!$A$62&\". Übung: \n\"&'Übersicht Übungen'!$E$62","v":"1. Übung: \n2 Minuten Liegen in einer Gruppe, Hundeführer außer Sicht"}]

{"sheet":"Liste Beginner","index":5,"n_rows":50,"n_cols":21,"rows_kept":50,"cut":false,"hidden":false,"merged":[[6,7,6,17],[1,0,1,2],[1,3,1,5],[1,7,1,15],[0,4,0,13],[3,0,5,5],[0,14,0,20],[1,18,1,20],[0,0,0,3]]}
["HSVRM Obedience:",null,null,null,{"$f":"Dateneingabe!C6&\"\"","v":"<Titel der Veranstaltung - z. B. Obedience-Prüfung>"},null,null,null,null,null,null,null,null,null,"Beginner-Klasse"]
["Veranstaltender Verein:",null,null,{"$f":"Dateneingabe!C5","v":"<Veranstaltender Verein oder Verband>"},null,null,"Leistungsrichter:",{"$f":"Dateneingabe!I4","v":"<Name der Leistungsrichter>"},null,null,null,null,null,null,null,null,null,"Datum:",{"$f":"Dateneingabe!C7","v":"<Prüfungstag/e>"}]
[]
["Ergebnisliste",null,null,null,null,null,"Übung",{"$f":"'Übersicht Übungen'!$A6","v":1},{"$f":"'Übersicht Übungen'!$A7","v":2},{"$f":"'Übersicht Übungen'!$A8","v":3},{"$f":"'Übersicht Übungen'!$A9","v":4},{"$f":"'Übersicht Übungen'!$A10","v":5},{"$f":"'Übersicht Übungen'!$A11","v":6},{"$f":"'Übersicht Übungen'!$A12","v":7},{"$f":"'Übersicht Übungen'!$A13","v":8},{"$f":"'Übersicht Übungen'!$A14","v":9},{"$f":"'Übersicht Übungen'!$A15","v":10},{"$f":"'Übersicht Übungen'!$A16","v":11}]
[null,null,null,null,null,null,"Reihenfolge",{"$f":"'Übersicht Übungen'!$B6","v":1},{"$f":"'Übersicht Übungen'!$B7","v":2},{"$f":"'Übersicht Übungen'!$B8","v":3},{"$f":"'Übersicht Übungen'!$B9","v":4},{"$f":"'Übersicht Übungen'!$B10","v":5},{"$f":"'Übersicht Übungen'!$B11","v":6},{"$f":"'Übersicht Übungen'!$B12","v":7},{"$f":"'Übersicht Übungen'!$B13","v":8},{"$f":"'Übersicht Übungen'!$B14","v":9},{"$f":"'Übersicht Übungen'!$B15","v":10},{"$f":"'Übersicht Übungen'!$B16","v":11}]
[null,null,null,null,null,null,"Koeffizient",{"$f":"'Übersicht Übungen'!$C6","v":4},{"$f":"'Übersicht Übungen'!$C7","v":3},{"$f":"'Übersicht Übungen'!$C8","v":3},{"$f":"'Übersicht Übungen'!$C9","v":3},{"$f":"'Übersicht Übungen'!$C10","v":2},{"$f":"'Übersicht Übungen'!$C11","v":3},{"$f":"'Übersicht Übungen'!$C12","v":3},{"$f":"'Übersicht Übungen'!$C13","v":3},{"$f":"'Übersicht Übungen'!$C14","v":3},{"$f":"'Übersicht Übungen'!$C15","v":3},{"$f":"'Übersicht Übungen'!$C16","v":2}]
["Nr.","Los","Hundeführer/-in","Verein","Verband","Hund","Rasse","Auswertung",null,null,null,null,null,null,null,null,null,null,"Gesamt","WN","Platz"]
[{"$f":"IF(Dateneingabe!A12=\"\",\"\",Dateneingabe!A12)","v":""},{"$f":"IF(Dateneingabe!B12=\"\",\"\",Dateneingabe!B12)","v":""},{"$f":"IF(Dateneingabe!E12=\"\",\"\",Dateneingabe!E12)","v":""},{"$f":"IF(Dateneingabe!F12=\"\",\"\",Dateneingabe!F12)","v":""},{"$f":"IF(Dateneingabe!G12=\"\",\"\",Dateneingabe!G12)","v":""},{"$f":"IF(Dateneingabe!H12=\"\",\"\",Dateneingabe!H12)","v":""},{"$f":"IF(Dateneingabe!I12=\"\",\"\",Dateneingabe!I12)","v":""},null,null,null,null,null,null,null,null,null,null,null,{"$f":"S27","v":0},{"$f":"IF(U8=\"DIS\",\"oAK\",IF(S8=0,\"\",IF(S8>$B$29,\"V\",IF(S8>$B$30,\"SG\",IF(S8>$B$31,\"G\",\"oAK\")))))","v":""}]
[{"$f":"IF(Dateneingabe!A13=\"\",\"\",Dateneingabe!A13)","v":""},{"$f":"IF(Dateneingabe!B13=\"\",\"\",Dateneingabe!B13)","v":""},{"$f":"IF(Dateneingabe!E13=\"\",\"\",Dateneingabe!E13)","v":""},{"$f":"IF(Dateneingabe!F13=\"\",\"\",Dateneingabe!F13)","v":""},{"$f":"IF(Dateneingabe!G13=\"\",\"\",Dateneingabe!G13)","v":""},{"$f":"IF(Dateneingabe!H13=\"\",\"\",Dateneingabe!H13)","v":""},{"$f":"IF(Dateneingabe!I13=\"\",\"\",Dateneingabe!I13)","v":""},null,null,null,null,null,null,null,null,null,null,null,0,""]
[{"$f":"IF(Dateneingabe!A14=\"\",\"\",Dateneingabe!A14)","v":""},{"$f":"IF(Dateneingabe!B14=\"\",\"\",Dateneingabe!B14)","v":""},{"$f":"IF(Dateneingabe!E14=\"\",\"\",Dateneingabe!E14)","v":""},{"$f":"IF(Dateneingabe!F14=\"\",\"\",Dateneingabe!F14)","v":""},{"$f":"IF(Dateneingabe!G14=\"\",\"\",Dateneingabe!G14)","v":""},{"$f":"IF(Dateneingabe!H14=\"\",\"\",Dateneingabe!H14)","v":""},{"$f":"IF(Dateneingabe!I14=\"\",\"\",Dateneingabe!I14)","v":""},null,null,null,null,null,null,null,null,null,null,null,0,""]
[{"$f":"IF(Dateneingabe!A15=\"\",\"\",Dateneingabe!A15)","v":""},{"$f":"IF(Dateneingabe!B15=\"\",\"\",Dateneingabe!B15)","v":""},{"$f":"IF(Dateneingabe!E15=\"\",\"\",Dateneingabe!E15)","v":""},{"$f":"IF(Dateneingabe!F15=\"\",\"\",Dateneingabe!F15)","v":""},{"$f":"IF(Dateneingabe!G15=\"\",\"\",Dateneingabe!G15)","v":""},{"$f":"IF(Dateneingabe!H15=\"\",\"\",Dateneingabe!H15)","v":""},{"$f":"IF(Dateneingabe!I15=\"\",\"\",Dateneingabe!I15)","v":""},null,null,null,null,null,null,null,null,null,null,null,0,""]
[{"$f":"IF(Dateneingabe!A16=\"\",\"\",Dateneingabe!A16)","v":""},{"$f":"IF(Dateneingabe!B16=\"\",\"\",Dateneingabe!B16)","v":""},{"$f":"IF(Dateneingabe!E16=\"\",\"\",Dateneingabe!E16)","v":""},{"$f":"IF(Dateneingabe!F16=\"\",\"\",Dateneingabe!F16)","v":""},{"$f":"IF(Dateneingabe!G16=\"\",\"\",Dateneingabe!G16)","v":""},{"$f":"IF(Dateneingabe!H16=\"\",\"\",Dateneingabe!H16)","v":""},{"$f":"IF(Dateneingabe!I16=\"\",\"\",Dateneingabe!I16)","v":""},null,null,null,null,null,null,null,null,null,null,null,0,""]
[{"$f":"IF(Dateneingabe!A17=\"\",\"\",Dateneingabe!A17)","v":""},{"$f":"IF(Dateneingabe!B17=\"\",\"\",Dateneingabe!B17)","v":""},{"$f":"IF(Dateneingabe!E17=\"\",\"\",Dateneingabe!E17)","v":""},{"$f":"IF(Dateneingabe!F17=\"\",\"\",Dateneingabe!F17)","v":""},{"$f":"IF(Dateneingabe!G17=\"\",\"\",Dateneingabe!G17)","v":""},{"$f":"IF(Dateneingabe!H17=\"\",\"\",Dateneingabe!H17)","v":""},{"$f":"IF(Dateneingabe!I17=\"\",\"\",Dateneingabe!I17)","v":""},null,null,null,null,null,null,null,null,null,null,null,0,""]
[{"$f":"IF(Dateneingabe!A18=\"\",\"\",Dateneingabe!A18)","v":""},{"$f":"IF(Dateneingabe!B18=\"\",\"\",Dateneingabe!B18)","v":""},{"$f":"IF(Dateneingabe!E18=\"\",\"\",Dateneingabe!E18)","v":""},{"$f":"IF(Dateneingabe!F18=\"\",\"\",Dateneingabe!F18)","v":""},{"$f":"IF(Dateneingabe!G18=\"\",\"\",Dateneingabe!G18)","v":""},{"$f":"IF(Dateneingabe!H18=\"\",\"\",Dateneingabe!H18)","v":""},{"$f":"IF(Dateneingabe!I18=\"\",\"\",Dateneingabe!I18)","v":""},null,null,null,null,null,null,null,null,null,null,null,0,""]
[{"$f":"IF(Dateneingabe!A19=\"\",\"\",Dateneingabe!A19)","v":""},{"$f":"IF(Dateneingabe!B19=\"\",\"\",Dateneingabe!B19)","v":""},{"$f":"IF(Dateneingabe!E19=\"\",\"\",Dateneingabe!E19)","v":""},{"$f":"IF(Dateneingabe!F19=\"\",\"\",Dateneingabe!F19)","v":""},{"$f":"IF(Dateneingabe!G19=\"\",\"\",Dateneingabe!G19)","v":""},{"$f":"IF(Dateneingabe!H19=\"\",\"\",Dateneingabe!H19)","v":""},{"$f":"IF(Dateneingabe!I19=\"\",\"\",Dateneingabe!I19)","v":""},null,null,null,null,null,null,null,null,null,null,null,0,""]
[{"$f":"IF(Dateneingabe!A20=\"\",\"\",Dateneingabe!A20)","v":""},{"$f":"IF(Dateneingabe!B20=\"\",\"\",Dateneingabe!B20)","v":""},{"$f":"IF(Dateneingabe!E20=\"\",\"\",Dateneingabe!E20)","v":""},{"$f":"IF(Dateneingabe!F20=\"\",\"\",Dateneingabe!F20)","v":""},{"$f":"IF(Dateneingabe!G20=\"\",\"\",Dateneingabe!G20)","v":""},{"$f":"IF(Dateneingabe!H20=\"\",\"\",Dateneingabe!H20)","v":""},{"$f":"IF(Dateneingabe!I20=\"\",\"\",Dateneingabe!I20)","v":""},null,null,null,null,null,null,null,null,null,null,null,0,""]
[{"$f":"IF(Dateneingabe!A21=\"\",\"\",Dateneingabe!A21)","v":""},{"$f":"IF(Dateneingabe!B21=\"\",\"\",Dateneingabe!B21)","v":""},{"$f":"IF(Dateneingabe!E21=\"\",\"\",Dateneingabe!E21)","v":""},{"$f":"IF(Dateneingabe!F21=\"\",\"\",Dateneingabe!F21)","v":""},{"$f":"IF(Dateneingabe!G21=\"\",\"\",Dateneingabe!G21)","v":""},{"$f":"IF(Dateneingabe!H21=\"\",\"\",Dateneingabe!H21)","v":""},{"$f":"IF(Dateneingabe!I21=\"\",\"\",Dateneingabe!I21)","v":""},null,null,null,null,null,null,null,null,null,null,null,0,""]
[{"$f":"IF(Dateneingabe!A22=\"\",\"\",Dateneingabe!A22)","v":""},{"$f":"IF(Dateneingabe!B22=\"\",\"\",Dateneingabe!B22)","v":""},{"$f":"IF(Dateneingabe!E22=\"\",\"\",Dateneingabe!E22)","v":""},{"$f":"IF(Dateneingabe!F22=\"\",\"\",Dateneingabe!F22)","v":""},{"$f":"IF(Dateneingabe!G22=\"\",\"\",Dateneingabe!G22)","v":""},{"$f":"IF(Dateneingabe!H22=\"\",\"\",Dateneingabe!H22)","v":""},{"$f":"IF(Dateneingabe!I22=\"\",\"\",Dateneingabe!I22)","v":""},null,null,null,null,null,null,null,null,null,null,null,0,""]
[{"$f":"IF(Dateneingabe!A23=\"\",\"\",Dateneingabe!A23)","v":""},{"$f":"IF(Dateneingabe!B23=\"\",\"\",Dateneingabe!B23)","v":""},{"$f":"IF(Dateneingabe!E23=\"\",\"\",Dateneingabe!E23)","v":""},{"$f":"IF(Dateneingabe!F23=\"\",\"\",Dateneingabe!F23)","v":""},{"$f":"IF(Dateneingabe!G23=\"\",\"\",Dateneingabe!G23)","v":""},{"$f":"IF(Dateneingabe!H23=\"\",\"\",Dateneingabe!H23)","v":""},{"$f":"IF(Dateneingabe!I23=\"\",\"\",Dateneingabe!I23)","v":""},null,null,null,null,null,null,null,null,null,null,null,0,""]
[{"$f":"IF(Dateneingabe!A24=\"\",\"\",Dateneingabe!A24)","v":""},{"$f":"IF(Dateneingabe!B24=\"\",\"\",Dateneingabe!B24)","v":""},{"$f":"IF(Dateneingabe!E24=\"\",\"\",Dateneingabe!E24)","v":""},{"$f":"IF(Dateneingabe!F24=\"\",\"\",Dateneingabe!F24)","v":""},{"$f":"IF(Dateneingabe!G24=\"\",\"\",Dateneingabe!G24)","v":""},{"$f":"IF(Dateneingabe!H24=\"\",\"\",Dateneingabe!H24)","v":""},{"$f":"IF(Dateneingabe!I24=\"\",\"\",Dateneingabe!I24)","v":""},null,null,null,null,null,null,null,null,null,null,null,0,""]
[{"$f":"IF(Dateneingabe!A25=\"\",\"\",Dateneingabe!A25)","v":""},{"$f":"IF(Dateneingabe!B25=\"\",\"\",Dateneingabe!B25)","v":""},{"$f":"IF(Dateneingabe!E25=\"\",\"\",Dateneingabe!E25)","v":""},{"$f":"IF(Dateneingabe!F25=\"\",\"\",Dateneingabe!F25)","v":""},{"$f":"IF(Dateneingabe!G25=\"\",\"\",Dateneingabe!G25)","v":""},{"$f":"IF(Dateneingabe!H25=\"\",\"\",Dateneingabe!H25)","v":""},{"$f":"IF(Dateneingabe!I25=\"\",\"\",Dateneingabe!I25)","v":""},null,null,null,null,null,null,null,null,null,null,null,0,""]
[{"$f":"IF(Dateneingabe!A26=\"\",\"\",Dateneingabe!A26)","v":""},{"$f":"IF(Dateneingabe!B26=\"\",\"\",Dateneingabe!B26)","v":""},{"$f":"IF(Dateneingabe!E26=\"\",\"\",Dateneingabe!E26)","v":""},{"$f":"IF(Dateneingabe!F26=\"\",\"\",Dateneingabe!F26)","v":""},{"$f":"IF(Dateneingabe!G26=\"\",\"\",Dateneingabe!G26)","v":""},{"$f":"IF(Dateneingabe!H26=\"\",\"\",Dateneingabe!H26)","v":""},{"$f":"IF(Dateneingabe!I26=\"\",\"\",Dateneingabe!I26)","v":""},null,null,null,null,null,null,null,null,null,null,null,0,""]
[{"$f":"IF(Dateneingabe!A27=\"\",\"\",Dateneingabe!A27)","v":""},{"$f":"IF(Dateneingabe!B27=\"\",\"\",Dateneingabe!B27)","v":""},{"$f":"IF(Dateneingabe!E27=\"\",\"\",Dateneingabe!E27)","v":""},{"$f":"IF(Dateneingabe!F27=\"\",\"\",Dateneingabe!F27)","v":""},{"$f":"IF(Dateneingabe!G27=\"\",\"\",Dateneingabe!G27)","v":""},{"$f":"IF(Dateneingabe!H27=\"\",\"\",Dateneingabe!H27)","v":""},{"$f":"IF(Dateneingabe!I27=\"\",\"\",Dateneingabe!I27)","v":""},null,null,null,null,null,null,null,null,null,null,null,0,""]
[{"$f":"IF(Dateneingabe!A28=\"\",\"\",Dateneingabe!A28)","v":""},{"$f":"IF(Dateneingabe!B28=\"\",\"\",Dateneingabe!B28)","v":""},{"$f":"IF(Dateneingabe!E28=\"\",\"\",Dateneingabe!E28)","v":""},{"$f":"IF(Dateneingabe!F28=\"\",\"\",Dateneingabe!F28)","v":""},{"$f":"IF(Dateneingabe!G28=\"\",\"\",Dateneingabe!G28)","v":""},{"$f":"IF(Dateneingabe!H28=\"\",\"\",Dateneingabe!H28)","v":""},{"$f":"IF(Dateneingabe!I28=\"\",\"\",Dateneingabe!I28)","v":""},null,null,null,null,null,null,null,null,null,null,null,0,""]
[{"$f":"IF(Dateneingabe!A29=\"\",\"\",Dateneingabe!A29)","v":""},{"$f":"IF(Dateneingabe!B29=\"\",\"\",Dateneingabe!B29)","v":""},{"$f":"IF(Dateneingabe!E29=\"\",\"\",Dateneingabe!E29)","v":""},{"$f":"IF(Dateneingabe!F29=\"\",\"\",Dateneingabe!F29)","v":""},{"$f":"IF(Dateneingabe!G29=\"\",\"\",Dateneingabe!G29)","v":""},{"$f":"IF(Dateneingabe!H29=\"\",\"\",Dateneingabe!H29)","v":""},{"$f":"IF(Dateneingabe!I29=\"\",\"\",Dateneingabe!I29)","v":""},null,null,null,null,null,null,null,null,null,null,null,0,""]
[{"$f":"'Hinweise - bitte beachten!!!'!A1:A1&\" - \"&'Hinweise - bitte beachten!!!'!A2:A2","v":"HSVRM Obedience Auswertung - Version 2019 v5.1 - erstellt von Sören Marquardt für den Hundesportverband Rhein-Main (HSVRM)"}]
[null,null,null,null,null,null,null,{"$f":"IF(H8=\"\",0,H8)","v":0},{"$f":"IF(I8=\"\",0,I8)","v":0},0,0,0,0,0,0,0,0,0,{"$f":"SUM(H27*$H$6+I27*$I$6+J27*$J$6+K27*$K$6+L27*$L$6+M27*$M$6+N27*$N$6+O27*$O$6+P27*$P$6+Q27*$Q$6+R27*$R$6)","v":0}]
[{"$f":"'Übersicht Übungen'!H7","v":256},{"$f":"'Übersicht Übungen'!I7","v":320},"Punkte","Punkte",null,null,null,{"$f":"IF(H9=\"\",0,H9)","v":0},0,0,0,0,0,0,0,0,0,0,0]
[{"$f":"'Übersicht Übungen'!H8","v":224},{"$f":"'Übersicht Übungen'!I8","v":255.5},0,0,null,null,null,0,0,0,0,0,0,0,0,0,0,0,0]
[{"$f":"'Übersicht Übungen'!H9","v":192},{"$f":"'Übersicht Übungen'!I9","v":223.5},5,5,null,null,null,0,0,0,0,0,0,0,0,0,0,0,0]
[{"$f":"'Übersicht Übungen'!H10","v":0},{"$f":"'Übersicht Übungen'!I10","v":191.5},5.25,5.5,null,null,null,0,0,0,0,0,0,0,0,0,0,0,0]
[null,null,5.5,6,null,null,null,0,0,0,0,0,0,0,0,0,0,0,0]
[null,null,5.75,6.5,null,null,null,0,0,0,0,0,0,0,0,0,0,0,0]
[null,null,6,7,null,null,null,0,0,0,0,0,0,0,0,0,0,0,0]
[null,null,6.25,7.5,null,null,null,0,0,0,0,0,0,0,0,0,0,0,0]
[null,null,6.5,8,null,null,null,0,0,0,0,0,0,0,0,0,0,0,0]
[null,null,6.75,8.5,null,null,null,0,0,0,0,0,0,0,0,0,0,0,0]
[null,null,7,9,null,null,null,0,0,0,0,0,0,0,0,0,0,0,0]
[null,null,7.25,9.5,null,null,null,0,0,0,0,0,0,0,0,0,0,0,0]
[null,null,7.5,10,null,null,null,0,0,0,0,0,0,0,0,0,0,0,0]
[null,null,7.75,null,null,null,null,0,0,0,0,0,0,0,0,0,0,0,0]
[null,null,8,null,null,null,null,0,0,0,0,0,0,0,0,0,0,0,0]
[null,null,8.25,null,null,null,null,0,0,0,0,0,0,0,0,0,0,0,0]
[null,null,8.5,null,null,null,null,{"$f":"IF(H25=\"\",0,H25)","v":0},0,0,0,0,0,0,0,0,0,0,0]
[null,null,8.75]
[null,null,9]
[null,null,9.25]
[null,null,9.5]
[null,null,9.75]
[null,null,10]

{"sheet":"Liste Klasse 1","index":6,"n_rows":50,"n_cols":21,"rows_kept":50,"cut":false,"hidden":false,"merged":[[6,7,6,17],[3,0,5,5],[0,0,0,3],[0,4,0,13],[0,14,0,20],[1,0,1,2],[1,3,1,5],[1,7,1,15],[1,18,1,20]]}
["HSVRM Obedience:",null,null,null,{"$f":"Dateneingabe!C6&\"\"","v":"<Titel der Veranstaltung - z. B. Obedience-Prüfung>"},null,null,null,null,null,null,null,null,null,"Klasse 1"]
["Veranstaltender Verein:",null,null,{"$f":"Dateneingabe!C5","v":"<Veranstaltender Verein oder Verband>"},null,null,"Leistungsrichter:",{"$f":"Dateneingabe!I4","v":"<Name der Leistungsrichter>"},null,null,null,null,null,null,null,null,null,"Datum:",{"$f":"Dateneingabe!C7","v":"<Prüfungstag/e>"}]
[]
["Ergebnisliste",null,null,null,null,null,"Übung",{"$f":"'Übersicht Übungen'!$A20","v":1},{"$f":"'Übersicht Übungen'!$A21","v":2},{"$f":"'Übersicht Übungen'!$A22","v":3},{"$f":"'Übersicht Übungen'!$A23","v":4},{"$f":"'Übersicht Übungen'!$A24","v":5},{"$f":"'Übersicht Übungen'!$A25","v":6},{"$f":"'Übersicht Übungen'!$A26","v":7},{"$f":"'Übersicht Übungen'!$A27","v":8},{"$f":"'Übersicht Übungen'!$A28","v":9},{"$f":"'Übersicht Übungen'!$A29","v":10},{"$f":"'Übersicht Übungen'!$A30","v":11}]
[null,null,null,null,null,null,"Reihenfolge",{"$f":"'Übersicht Übungen'!$B20","v":1},{"$f":"'Übersicht Übungen'!$B21","v":2},{"$f":"'Übersicht Übungen'!$B22","v":3},{"$f":"'Übersicht Übungen'!$B23","v":4},{"$f":"'Übersicht Übungen'!$B24","v":5},{"$f":"'Übersicht Übungen'!$B25","v":6},{"$f":"'Übersicht Übungen'!$B26","v":7},{"$f":"'Übersicht Übungen'!$B27","v":8},{"$f":"'Übersicht Übungen'!$B28","v":9},{"$f":"'Übersicht Übungen'!$B29","v":10},{"$f":"'Übersicht Übungen'!$B30","v":11}]
[null,null,null,null,null,null,"Koeffizient",{"$f":"'Übersicht Übungen'!$C20","v":3},{"$f":"'Übersicht Übungen'!$C21","v":3},{"$f":"'Übersicht Übungen'!$C22","v":3},{"$f":"'Übersicht Übungen'!$C23","v":3},{"$f":"'Übersicht Übungen'!$C24","v":2},{"$f":"'Übersicht Übungen'!$C25","v":3},{"$f":"'Übersicht Übungen'!$C26","v":4},{"$f":"'Übersicht Übungen'!$C27","v":3},{"$f":"'Übersicht Übungen'!$C28","v":3},{"$f":"'Übersicht Übungen'!$C29","v":3},{"$f":"'Übersicht Übungen'!$C30","v":2}]
["Nr.","Los","Hundeführer/-in","Verein","Verband","Hund","Rasse","Auswertung",null,null,null,null,null,null,null,null,null,null,"Gesamt","WN","Platz"]
[{"$f":"IF(Dateneingabe!A32=\"\",\"\",Dateneingabe!A32)","v":""},{"$f":"IF(Dateneingabe!B32=\"\",\"\",Dateneingabe!B32)","v":""},{"$f":"IF(Dateneingabe!E32=\"\",\"\",Dateneingabe!E32)","v":""},{"$f":"IF(Dateneingabe!F32=\"\",\"\",Dateneingabe!F32)","v":""},{"$f":"IF(Dateneingabe!G32=\"\",\"\",Dateneingabe!G32)","v":""},{"$f":"IF(Dateneingabe!H32=\"\",\"\",Dateneingabe!H32)","v":""},{"$f":"IF(Dateneingabe!I32=\"\",\"\",Dateneingabe!I32)","v":""},null,null,null,null,null,null,null,null,null,null,null,{"$f":"S27","v":0},{"$f":"IF(U8=\"DIS\",\"oAK\",IF(S8=0,\"\",IF(S8>$B$29,\"V\",IF(S8>$B$30,\"SG\",IF(S8>$B$31,\"G\",\"oAK\")))))","v":""}]
[{"$f":"IF(Dateneingabe!A33=\"\",\"\",Dateneingabe!A33)","v":""},{"$f":"IF(Dateneingabe!B33=\"\",\"\",Dateneingabe!B33)","v":""},{"$f":"IF(Dateneingabe!E33=\"\",\"\",Dateneingabe!E33)","v":""},{"$f":"IF(Dateneingabe!F33=\"\",\"\",Dateneingabe!F33)","v":""},{"$f":"IF(Dateneingabe!G33=\"\",\"\",Dateneingabe!G33)","v":""},{"$f":"IF(Dateneingabe!H33=\"\",\"\",Dateneingabe!H33)","v":""},{"$f":"IF(Dateneingabe!I33=\"\",\"\",Dateneingabe!I33)","v":""},null,null,null,null,null,null,null,null,null,null,null,{"$f":"S28","v":0},""]
[{"$f":"IF(Dateneingabe!A34=\"\",\"\",Dateneingabe!A34)","v":""},{"$f":"IF(Dateneingabe!B34=\"\",\"\",Dateneingabe!B34)","v":""},{"$f":"IF(Dateneingabe!E34=\"\",\"\",Dateneingabe!E34)","v":""},{"$f":"IF(Dateneingabe!F34=\"\",\"\",Dateneingabe!F34)","v":""},{"$f":"IF(Dateneingabe!G34=\"\",\"\",Dateneingabe!G34)","v":""},{"$f":"IF(Dateneingabe!H34=\"\",\"\",Dateneingabe!H34)","v":""},{"$f":"IF(Dateneingabe!I34=\"\",\"\",Dateneingabe!I34)","v":""},null,null,null,null,null,null,null,null,null,null,null,0,""]
[{"$f":"IF(Dateneingabe!A35=\"\",\"\",Dateneingabe!A35)","v":""},{"$f":"IF(Dateneingabe!B35=\"\",\"\",Dateneingabe!B35)","v":""},{"$f":"IF(Dateneingabe!E35=\"\",\"\",Dateneingabe!E35)","v":""},{"$f":"IF(Dateneingabe!F35=\"\",\"\",Dateneingabe!F35)","v":""},{"$f":"IF(Dateneingabe!G35=\"\",\"\",Dateneingabe!G35)","v":""},{"$f":"IF(Dateneingabe!H35=\"\",\"\",Dateneingabe!H35)","v":""},{"$f":"IF(Dateneingabe!I35=\"\",\"\",Dateneingabe!I35)","v":""},null,null,null,null,null,null,null,null,null,null,null,0,""]
[{"$f":"IF(Dateneingabe!A36=\"\",\"\",Dateneingabe!A36)","v":""},{"$f":"IF(Dateneingabe!B36=\"\",\"\",Dateneingabe!B36)","v":""},{"$f":"IF(Dateneingabe!E36=\"\",\"\",Dateneingabe!E36)","v":""},{"$f":"IF(Dateneingabe!F36=\"\",\"\",Dateneingabe!F36)","v":""},{"$f":"IF(Dateneingabe!G36=\"\",\"\",Dateneingabe!G36)","v":""},{"$f":"IF(Dateneingabe!H36=\"\",\"\",Dateneingabe!H36)","v":""},{"$f":"IF(Dateneingabe!I36=\"\",\"\",Dateneingabe!I36)","v":""},null,null,null,null,null,null,null,null,null,null,null,0,""]
[{"$f":"IF(Dateneingabe!A37=\"\",\"\",Dateneingabe!A37)","v":""},{"$f":"IF(Dateneingabe!B37=\"\",\"\",Dateneingabe!B37)","v":""},{"$f":"IF(Dateneingabe!E37=\"\",\"\",Dateneingabe!E37)","v":""},{"$f":"IF(Dateneingabe!F37=\"\",\"\",Dateneingabe!F37)","v":""},{"$f":"IF(Dateneingabe!G37=\"\",\"\",Dateneingabe!G37)","v":""},{"$f":"IF(Dateneingabe!H37=\"\",\"\",Dateneingabe!H37)","v":""},{"$f":"IF(Dateneingabe!I37=\"\",\"\",Dateneingabe!I37)","v":""},null,null,null,null,null,null,null,null,null,null,null,0,""]
[{"$f":"IF(Dateneingabe!A38=\"\",\"\",Dateneingabe!A38)","v":""},{"$f":"IF(Dateneingabe!B38=\"\",\"\",Dateneingabe!B38)","v":""},{"$f":"IF(Dateneingabe!E38=\"\",\"\",Dateneingabe!E38)","v":""},{"$f":"IF(Dateneingabe!F38=\"\",\"\",Dateneingabe!F38)","v":""},{"$f":"IF(Dateneingabe!G38=\"\",\"\",Dateneingabe!G38)","v":""},{"$f":"IF(Dateneingabe!H38=\"\",\"\",Dateneingabe!H38)","v":""},{"$f":"IF(Dateneingabe!I38=\"\",\"\",Dateneingabe!I38)","v":""},null,null,null,null,null,null,null,null,null,null,null,0,""]
[{"$f":"IF(Dateneingabe!A39=\"\",\"\",Dateneingabe!A39)","v":""},{"$f":"IF(Dateneingabe!B39=\"\",\"\",Dateneingabe!B39)","v":""},{"$f":"IF(Dateneingabe!E39=\"\",\"\",Dateneingabe!E39)","v":""},{"$f":"IF(Dateneingabe!F39=\"\",\"\",Dateneingabe!F39)","v":""},{"$f":"IF(Dateneingabe!G39=\"\",\"\",Dateneingabe!G39)","v":""},{"$f":"IF(Dateneingabe!H39=\"\",\"\",Dateneingabe!H39)","v":""},{"$f":"IF(Dateneingabe!I39=\"\",\"\",Dateneingabe!I39)","v":""},null,null,null,null,null,null,null,null,null,null,null,0,""]
[{"$f":"IF(Dateneingabe!A40=\"\",\"\",Dateneingabe!A40)","v":""},{"$f":"IF(Dateneingabe!B40=\"\",\"\",Dateneingabe!B40)","v":""},{"$f":"IF(Dateneingabe!E40=\"\",\"\",Dateneingabe!E40)","v":""},{"$f":"IF(Dateneingabe!F40=\"\",\"\",Dateneingabe!F40)","v":""},{"$f":"IF(Dateneingabe!G40=\"\",\"\",Dateneingabe!G40)","v":""},{"$f":"IF(Dateneingabe!H40=\"\",\"\",Dateneingabe!H40)","v":""},{"$f":"IF(Dateneingabe!I40=\"\",\"\",Dateneingabe!I40)","v":""},null,null,null,null,null,null,null,null,null,null,null,0,""]
[{"$f":"IF(Dateneingabe!A41=\"\",\"\",Dateneingabe!A41)","v":""},{"$f":"IF(Dateneingabe!B41=\"\",\"\",Dateneingabe!B41)","v":""},{"$f":"IF(Dateneingabe!E41=\"\",\"\",Dateneingabe!E41)","v":""},{"$f":"IF(Dateneingabe!F41=\"\",\"\",Dateneingabe!F41)","v":""},{"$f":"IF(Dateneingabe!G41=\"\",\"\",Dateneingabe!G41)","v":""},{"$f":"IF(Dateneingabe!H41=\"\",\"\",Dateneingabe!H41)","v":""},{"$f":"IF(Dateneingabe!I41=\"\",\"\",Dateneingabe!I41)","v":""},null,null,null,null,null,null,null,null,null,null,null,0,""]
[{"$f":"IF(Dateneingabe!A42=\"\",\"\",Dateneingabe!A42)","v":""},{"$f":"IF(Dateneingabe!B42=\"\",\"\",Dateneingabe!B42)","v":""},{"$f":"IF(Dateneingabe!E42=\"\",\"\",Dateneingabe!E42)","v":""},{"$f":"IF(Dateneingabe!F42=\"\",\"\",Dateneingabe!F42)","v":""},{"$f":"IF(Dateneingabe!G42=\"\",\"\",Dateneingabe!G42)","v":""},{"$f":"IF(Dateneingabe!H42=\"\",\"\",Dateneingabe!H42)","v":""},{"$f":"IF(Dateneingabe!I42=\"\",\"\",Dateneingabe!I42)","v":""},null,null,null,null,null,null,null,null,null,null,null,0,""]
[{"$f":"IF(Dateneingabe!A43=\"\",\"\",Dateneingabe!A43)","v":""},{"$f":"IF(Dateneingabe!B43=\"\",\"\",Dateneingabe!B43)","v":""},{"$f":"IF(Dateneingabe!E43=\"\",\"\",Dateneingabe!E43)","v":""},{"$f":"IF(Dateneingabe!F43=\"\",\"\",Dateneingabe!F43)","v":""},{"$f":"IF(Dateneingabe!G43=\"\",\"\",Dateneingabe!G43)","v":""},{"$f":"IF(Dateneingabe!H43=\"\",\"\",Dateneingabe!H43)","v":""},{"$f":"IF(Dateneingabe!I43=\"\",\"\",Dateneingabe!I43)","v":""},null,null,null,null,null,null,null,null,null,null,null,0,""]
[{"$f":"IF(Dateneingabe!A44=\"\",\"\",Dateneingabe!A44)","v":""},{"$f":"IF(Dateneingabe!B44=\"\",\"\",Dateneingabe!B44)","v":""},{"$f":"IF(Dateneingabe!E44=\"\",\"\",Dateneingabe!E44)","v":""},{"$f":"IF(Dateneingabe!F44=\"\",\"\",Dateneingabe!F44)","v":""},{"$f":"IF(Dateneingabe!G44=\"\",\"\",Dateneingabe!G44)","v":""},{"$f":"IF(Dateneingabe!H44=\"\",\"\",Dateneingabe!H44)","v":""},{"$f":"IF(Dateneingabe!I44=\"\",\"\",Dateneingabe!I44)","v":""},null,null,null,null,null,null,null,null,null,null,null,0,""]
[{"$f":"IF(Dateneingabe!A45=\"\",\"\",Dateneingabe!A45)","v":""},{"$f":"IF(Dateneingabe!B45=\"\",\"\",Dateneingabe!B45)","v":""},{"$f":"IF(Dateneingabe!E45=\"\",\"\",Dateneingabe!E45)","v":""},{"$f":"IF(Dateneingabe!F45=\"\",\"\",Dateneingabe!F45)","v":""},{"$f":"IF(Dateneingabe!G45=\"\",\"\",Dateneingabe!G45)","v":""},{"$f":"IF(Dateneingabe!H45=\"\",\"\",Dateneingabe!H45)","v":""},{"$f":"IF(Dateneingabe!I45=\"\",\"\",Dateneingabe!I45)","v":""},null,null,null,null,null,null,null,null,null,null,null,0,""]
[{"$f":"IF(Dateneingabe!A46=\"\",\"\",Dateneingabe!A46)","v":""},{"$f":"IF(Dateneingabe!B46=\"\",\"\",Dateneingabe!B46)","v":""},{"$f":"IF(Dateneingabe!E46=\"\",\"\",Dateneingabe!E46)","v":""},{"$f":"IF(Dateneingabe!F46=\"\",\"\",Dateneingabe!F46)","v":""},{"$f":"IF(Dateneingabe!G46=\"\",\"\",Dateneingabe!G46)","v":""},{"$f":"IF(Dateneingabe!H46=\"\",\"\",Dateneingabe!H46)","v":""},{"$f":"IF(Dateneingabe!I46=\"\",\"\",Dateneingabe!I46)","v":""},null,null,null,null,null,null,null,null,null,null,null,0,""]
[{"$f":"IF(Dateneingabe!A47=\"\",\"\",Dateneingabe!A47)","v":""},{"$f":"IF(Dateneingabe!B47=\"\",\"\",Dateneingabe!B47)","v":""},{"$f":"IF(Dateneingabe!E47=\"\",\"\",Dateneingabe!E47)","v":""},{"$f":"IF(Dateneingabe!F47=\"\",\"\",Dateneingabe!F47)","v":""},{"$f":"IF(Dateneingabe!G47=\"\",\"\",Dateneingabe!G47)","v":""},{"$f":"IF(Dateneingabe!H47=\"\",\"\",Dateneingabe!H47)","v":""},{"$f":"IF(Dateneingabe!I47=\"\",\"\",Dateneingabe!I47)","v":""},null,null,null,null,null,null,null,null,null,null,null,0,""]
[{"$f":"IF(Dateneingabe!A48=\"\",\"\",Dateneingabe!A48)","v":""},{"$f":"IF(Dateneingabe!B48=\"\",\"\",Dateneingabe!B48)","v":""},{"$f":"IF(Dateneingabe!E48=\"\",\"\",Dateneingabe!E48)","v":""},{"$f":"IF(Dateneingabe!F48=\"\",\"\",Dateneingabe!F48)","v":""},{"$f":"IF(Dateneingabe!G48=\"\",\"\",Dateneingabe!G48)","v":""},{"$f":"IF(Dateneingabe!H48=\"\",\"\",Dateneingabe!H48)","v":""},{"$f":"IF(Dateneingabe!I48=\"\",\"\",Dateneingabe!I48)","v":""},null,null,null,null,null,null,null,null,null,null,null,0,""]
[{"$f":"IF(Dateneingabe!A49=\"\",\"\",Dateneingabe!A49)","v":""},{"$f":"IF(Dateneingabe!B49=\"\",\"\",Dateneingabe!B49)","v":""},{"$f":"IF(Dateneingabe!E49=\"\",\"\",Dateneingabe!E49)","v":""},{"$f":"IF(Dateneingabe!F49=\"\",\"\",Dateneingabe!F49)","v":""},{"$f":"IF(Dateneingabe!G49=\"\",\"\",Dateneingabe!G49)","v":""},{"$f":"IF(Dateneingabe!H49=\"\",\"\",Dateneingabe!H49)","v":""},{"$f":"IF(Dateneingabe!I49=\"\",\"\",Dateneingabe!I49)","v":""},null,null,null,null,null,null,null,null,null,null,null,0,""]
[{"$f":"'Hinweise - bitte beachten!!!'!A1:A1&\" - \"&'Hinweise - bitte beachten!!!'!A2:A2","v":"HSVRM Obedience Auswertung - Version 2019 v5.1 - erstellt von Sören Marquardt für den Hundesportverband Rhein-Main (HSVRM)"}]
[null,null,null,null,null,null,null,{"$f":"IF(H8=\"\",0,H8)","v":0},{"$f":"IF(I8=\"\",0,I8)","v":0},0,0,0,0,0,0,0,0,0,{"$f":"SUM(H27*$H$6+I27*$I$6+J27*$J$6+K27*$K$6+L27*$L$6+M27*$M$6+N27*$N$6+O27*$O$6+P27*$P$6+Q27*$Q$6+R27*$R$6)","v":0}]
[{"$f":"'Übersicht Übungen'!H21","v":256},{"$f":"'Übersicht Übungen'!I21","v":320},"Punkte","Punkte",null,null,null,{"$f":"IF(H9=\"\",0,H9)","v":0},0,0,0,0,0,0,0,0,0,0,0]
[{"$f":"'Übersicht Übungen'!H22","v":224},{"$f":"'Übersicht Übungen'!I22","v":255.5},0,0,null,null,null,0,0,0,0,0,0,0,0,0,0,0,0]
[{"$f":"'Übersicht Übungen'!H23","v":192},{"$f":"'Übersicht Übungen'!I23","v":223.5},5,5,null,null,null,0,0,0,0,0,0,0,0,0,0,0,0]
[{"$f":"'Übersicht Übungen'!H24","v":0},{"$f":"'Übersicht Übungen'!I24","v":191.5},5.25,5.5,null,null,null,0,0,0,0,0,0,0,0,0,0,0,0]
[null,null,5.5,6,null,null,null,0,0,0,0,0,0,0,0,0,0,0,0]
[null,null,5.75,6.5,null,null,null,0,0,0,0,0,0,0,0,0,0,0,0]
[null,null,6,7,null,null,null,0,0,0,0,0,0,0,0,0,0,0,0]
[null,null,6.25,7.5,null,null,null,0,0,0,0,0,0,0,0,0,0,0,0]
[null,null,6.5,8,null,null,null,0,0,0,0,0,0,0,0,0,0,0,0]
[null,null,6.75,8.5,null,null,null,0,0,0,0,0,0,0,0,0,0,0,0]
[null,null,7,9,null,null,null,0,0,0,0,0,0,0,0,0,0,0,0]
[null,null,7.25,9.5,null,null,null,0,0,0,0,0,0,0,0,0,0,0,0]
[null,null,7.5,10,null,null,null,0,0,0,0,0,0,0,0,0,0,0,0]
[null,null,7.75,null,null,null,null,0,0,0,0,0,0,0,0,0,0,0,0]
[null,null,8,null,null,null,null,0,0,0,0,0,0,0,0,0,0,0,0]
[null,null,8.25,null,null,null,null,0,0,0,0,0,0,0,0,0,0,0,0]
[null,null,8.5,null,null,null,null,{"$f":"IF(H25=\"\",0,H25)","v":0},0,0,0,0,0,0,0,0,0,0,0]
[null,null,8.75]
[null,null,9]
[null,null,9.25]
[null,null,9.5]
[null,null,9.75]
[null,null,10]

{"sheet":"Liste Klasse 2","index":7,"n_rows":50,"n_cols":21,"rows_kept":50,"cut":false,"hidden":false,"merged":[[3,0,5,5],[6,7,6,17],[0,0,0,3],[0,4,0,13],[0,14,0,20],[1,0,1,2],[1,3,1,5],[1,7,1,15],[1,18,1,20]]}
["HSVRM Obedience:",null,null,null,{"$f":"Dateneingabe!C6&\"\"","v":"<Titel der Veranstaltung - z. B. Obedience-Prüfung>"},null,null,null,null,null,null,null,null,null,"Klasse 2"]
["Veranstaltender Verein:",null,null,{"$f":"Dateneingabe!C5","v":"<Veranstaltender Verein oder Verband>"},null,null,"Leistungsrichter:",{"$f":"Dateneingabe!I4","v":"<Name der Leistungsrichter>"},null,null,null,null,null,null,null,null,null,"Datum:",{"$f":"Dateneingabe!C7","v":"<Prüfungstag/e>"}]
[]
["Ergebnisliste",null,null,null,null,null,"Übung",{"$f":"'Übersicht Übungen'!$A34","v":1},{"$f":"'Übersicht Übungen'!$A35","v":2},{"$f":"'Übersicht Übungen'!$A36","v":3},{"$f":"'Übersicht Übungen'!$A37","v":4},{"$f":"'Übersicht Übungen'!$A38","v":5},{"$f":"'Übersicht Übungen'!$A39","v":6},{"$f":"'Übersicht Übungen'!$A40","v":7},{"$f":"'Übersicht Übungen'!$A41","v":8},{"$f":"'Übersicht Übungen'!$A42","v":9},{"$f":"'Übersicht Übungen'!$A43","v":10},{"$f":"'Übersicht Übungen'!$A44","v":0}]
[null,null,null,null,null,null,"Reihenfolge",{"$f":"'Übersicht Übungen'!$B34","v":1},{"$f":"'Übersicht Übungen'!$B35","v":2},{"$f":"'Übersicht Übungen'!$B36","v":3},{"$f":"'Übersicht Übungen'!$B37","v":4},{"$f":"'Übersicht Übungen'!$B38","v":5},{"$f":"'Übersicht Übungen'!$B39","v":6},{"$f":"'Übersicht Übungen'!$B40","v":7},{"$f":"'Übersicht Übungen'!$B41","v":8},{"$f":"'Übersicht Übungen'!$B42","v":9},{"$f":"'Übersicht Übungen'!$B43","v":10},{"$f":"'Übersicht Übungen'!$B44","v":0}]
[null,null,null,null,null,null,"Koeffizient",{"$f":"'Übersicht Übungen'!$C34","v":2},{"$f":"'Übersicht Übungen'!$C35","v":3},{"$f":"'Übersicht Übungen'!$C36","v":3},{"$f":"'Übersicht Übungen'!$C37","v":4},{"$f":"'Übersicht Übungen'!$C38","v":4},{"$f":"'Übersicht Übungen'!$C39","v":3},{"$f":"'Übersicht Übungen'!$C40","v":4},{"$f":"'Übersicht Übungen'!$C41","v":4},{"$f":"'Übersicht Übungen'!$C42","v":3},{"$f":"'Übersicht Übungen'!$C43","v":2},{"$f":"'Übersicht Übungen'!$C44","v":0}]
["Nr.","Los","Hundeführer/-in","Verein","Verband","Hund","Rasse","Auswertung",null,null,null,null,null,null,null,null,null,null,"Gesamt","WN","Platz"]
[{"$f":"IF(Dateneingabe!A52=\"\",\"\",Dateneingabe!A52)","v":""},{"$f":"IF(Dateneingabe!B52=\"\",\"\",Dateneingabe!B52)","v":""},{"$f":"IF(Dateneingabe!E52=\"\",\"\",Dateneingabe!E52)","v":""},{"$f":"IF(Dateneingabe!F52=\"\",\"\",Dateneingabe!F52)","v":""},{"$f":"IF(Dateneingabe!G52=\"\",\"\",Dateneingabe!G52)","v":""},{"$f":"IF(Dateneingabe!H52=\"\",\"\",Dateneingabe!H52)","v":""},{"$f":"IF(Dateneingabe!I52=\"\",\"\",Dateneingabe!I52)","v":""},null,null,null,null,null,null,null,null,null,null,null,{"$f":"S27","v":0},{"$f":"IF(U8=\"DIS\",\"oAK\",IF(S8=0,\"\",IF(S8>$B$29,\"V\",IF(S8>$B$30,\"SG\",IF(S8>$B$31,\"G\",\"oAK\")))))","v":""}]
[{"$f":"IF(Dateneingabe!A53=\"\",\"\",Dateneingabe!A53)","v":""},{"$f":"IF(Dateneingabe!B53=\"\",\"\",Dateneingabe!B53)","v":""},{"$f":"IF(Dateneingabe!E53=\"\",\"\",Dateneingabe!E53)","v":""},{"$f":"IF(Dateneingabe!F53=\"\",\"\",Dateneingabe!F53)","v":""},{"$f":"IF(Dateneingabe!G53=\"\",\"\",Dateneingabe!G53)","v":""},{"$f":"IF(Dateneingabe!H53=\"\",\"\",Dateneingabe!H53)","v":""},{"$f":"IF(Dateneingabe!I53=\"\",\"\",Dateneingabe!I53)","v":""},null,null,null,null,null,null,null,null,null,null,null,{"$f":"S28","v":0},""]
[{"$f":"IF(Dateneingabe!A54=\"\",\"\",Dateneingabe!A54)","v":""},{"$f":"IF(Dateneingabe!B54=\"\",\"\",Dateneingabe!B54)","v":""},{"$f":"IF(Dateneingabe!E54=\"\",\"\",Dateneingabe!E54)","v":""},{"$f":"IF(Dateneingabe!F54=\"\",\"\",Dateneingabe!F54)","v":""},{"$f":"IF(Dateneingabe!G54=\"\",\"\",Dateneingabe!G54)","v":""},{"$f":"IF(Dateneingabe!H54=\"\",\"\",Dateneingabe!H54)","v":""},{"$f":"IF(Dateneingabe!I54=\"\",\"\",Dateneingabe!I54)","v":""},null,null,null,null,null,null,null,null,null,null,null,0,""]
[{"$f":"IF(Dateneingabe!A55=\"\",\"\",Dateneingabe!A55)","v":""},{"$f":"IF(Dateneingabe!B55=\"\",\"\",Dateneingabe!B55)","v":""},{"$f":"IF(Dateneingabe!E55=\"\",\"\",Dateneingabe!E55)","v":""},{"$f":"IF(Dateneingabe!F55=\"\",\"\",Dateneingabe!F55)","v":""},{"$f":"IF(Dateneingabe!G55=\"\",\"\",Dateneingabe!G55)","v":""},{"$f":"IF(Dateneingabe!H55=\"\",\"\",Dateneingabe!H55)","v":""},{"$f":"IF(Dateneingabe!I55=\"\",\"\",Dateneingabe!I55)","v":""},null,null,null,null,null,null,null,null,null,null,null,0,""]
[{"$f":"IF(Dateneingabe!A56=\"\",\"\",Dateneingabe!A56)","v":""},{"$f":"IF(Dateneingabe!B56=\"\",\"\",Dateneingabe!B56)","v":""},{"$f":"IF(Dateneingabe!E56=\"\",\"\",Dateneingabe!E56)","v":""},{"$f":"IF(Dateneingabe!F56=\"\",\"\",Dateneingabe!F56)","v":""},{"$f":"IF(Dateneingabe!G56=\"\",\"\",Dateneingabe!G56)","v":""},{"$f":"IF(Dateneingabe!H56=\"\",\"\",Dateneingabe!H56)","v":""},{"$f":"IF(Dateneingabe!I56=\"\",\"\",Dateneingabe!I56)","v":""},null,null,null,null,null,null,null,null,null,null,null,0,""]
[{"$f":"IF(Dateneingabe!A57=\"\",\"\",Dateneingabe!A57)","v":""},{"$f":"IF(Dateneingabe!B57=\"\",\"\",Dateneingabe!B57)","v":""},{"$f":"IF(Dateneingabe!E57=\"\",\"\",Dateneingabe!E57)","v":""},{"$f":"IF(Dateneingabe!F57=\"\",\"\",Dateneingabe!F57)","v":""},{"$f":"IF(Dateneingabe!G57=\"\",\"\",Dateneingabe!G57)","v":""},{"$f":"IF(Dateneingabe!H57=\"\",\"\",Dateneingabe!H57)","v":""},{"$f":"IF(Dateneingabe!I57=\"\",\"\",Dateneingabe!I57)","v":""},null,null,null,null,null,null,null,null,null,null,null,0,""]
[{"$f":"IF(Dateneingabe!A58=\"\",\"\",Dateneingabe!A58)","v":""},{"$f":"IF(Dateneingabe!B58=\"\",\"\",Dateneingabe!B58)","v":""},{"$f":"IF(Dateneingabe!E58=\"\",\"\",Dateneingabe!E58)","v":""},{"$f":"IF(Dateneingabe!F58=\"\",\"\",Dateneingabe!F58)","v":""},{"$f":"IF(Dateneingabe!G58=\"\",\"\",Dateneingabe!G58)","v":""},{"$f":"IF(Dateneingabe!H58=\"\",\"\",Dateneingabe!H58)","v":""},{"$f":"IF(Dateneingabe!I58=\"\",\"\",Dateneingabe!I58)","v":""},null,null,null,null,null,null,null,null,null,null,null,0,""]
[{"$f":"IF(Dateneingabe!A59=\"\",\"\",Dateneingabe!A59)","v":""},{"$f":"IF(Dateneingabe!B59=\"\",\"\",Dateneingabe!B59)","v":""},{"$f":"IF(Dateneingabe!E59=\"\",\"\",Dateneingabe!E59)","v":""},{"$f":"IF(Dateneingabe!F59=\"\",\"\",Dateneingabe!F59)","v":""},{"$f":"IF(Dateneingabe!G59=\"\",\"\",Dateneingabe!G59)","v":""},{"$f":"IF(Dateneingabe!H59=\"\",\"\",Dateneingabe!H59)","v":""},{"$f":"IF(Dateneingabe!I59=\"\",\"\",Dateneingabe!I59)","v":""},null,null,null,null,null,null,null,null,null,null,null,0,""]
[{"$f":"IF(Dateneingabe!A60=\"\",\"\",Dateneingabe!A60)","v":""},{"$f":"IF(Dateneingabe!B60=\"\",\"\",Dateneingabe!B60)","v":""},{"$f":"IF(Dateneingabe!E60=\"\",\"\",Dateneingabe!E60)","v":""},{"$f":"IF(Dateneingabe!F60=\"\",\"\",Dateneingabe!F60)","v":""},{"$f":"IF(Dateneingabe!G60=\"\",\"\",Dateneingabe!G60)","v":""},{"$f":"IF(Dateneingabe!H60=\"\",\"\",Dateneingabe!H60)","v":""},{"$f":"IF(Dateneingabe!I60=\"\",\"\",Dateneingabe!I60)","v":""},null,null,null,null,null,null,null,null,null,null,null,0,""]
[{"$f":"IF(Dateneingabe!A61=\"\",\"\",Dateneingabe!A61)","v":""},{"$f":"IF(Dateneingabe!B61=\"\",\"\",Dateneingabe!B61)","v":""},{"$f":"IF(Dateneingabe!E61=\"\",\"\",Dateneingabe!E61)","v":""},{"$f":"IF(Dateneingabe!F61=\"\",\"\",Dateneingabe!F61)","v":""},{"$f":"IF(Dateneingabe!G61=\"\",\"\",Dateneingabe!G61)","v":""},{"$f":"IF(Dateneingabe!H61=\"\",\"\",Dateneingabe!H61)","v":""},{"$f":"IF(Dateneingabe!I61=\"\",\"\",Dateneingabe!I61)","v":""},null,null,null,null,null,null,null,null,null,null,null,0,""]
[{"$f":"IF(Dateneingabe!A62=\"\",\"\",Dateneingabe!A62)","v":""},{"$f":"IF(Dateneingabe!B62=\"\",\"\",Dateneingabe!B62)","v":""},{"$f":"IF(Dateneingabe!E62=\"\",\"\",Dateneingabe!E62)","v":""},{"$f":"IF(Dateneingabe!F62=\"\",\"\",Dateneingabe!F62)","v":""},{"$f":"IF(Dateneingabe!G62=\"\",\"\",Dateneingabe!G62)","v":""},{"$f":"IF(Dateneingabe!H62=\"\",\"\",Dateneingabe!H62)","v":""},{"$f":"IF(Dateneingabe!I62=\"\",\"\",Dateneingabe!I62)","v":""},null,null,null,null,null,null,null,null,null,null,null,0,""]
[{"$f":"IF(Dateneingabe!A63=\"\",\"\",Dateneingabe!A63)","v":""},{"$f":"IF(Dateneingabe!B63=\"\",\"\",Dateneingabe!B63)","v":""},{"$f":"IF(Dateneingabe!E63=\"\",\"\",Dateneingabe!E63)","v":""},{"$f":"IF(Dateneingabe!F63=\"\",\"\",Dateneingabe!F63)","v":""},{"$f":"IF(Dateneingabe!G63=\"\",\"\",Dateneingabe!G63)","v":""},{"$f":"IF(Dateneingabe!H63=\"\",\"\",Dateneingabe!H63)","v":""},{"$f":"IF(Dateneingabe!I63=\"\",\"\",Dateneingabe!I63)","v":""},null,null,null,null,null,null,null,null,null,null,null,0,""]
[{"$f":"IF(Dateneingabe!A64=\"\",\"\",Dateneingabe!A64)","v":""},{"$f":"IF(Dateneingabe!B64=\"\",\"\",Dateneingabe!B64)","v":""},{"$f":"IF(Dateneingabe!E64=\"\",\"\",Dateneingabe!E64)","v":""},{"$f":"IF(Dateneingabe!F64=\"\",\"\",Dateneingabe!F64)","v":""},{"$f":"IF(Dateneingabe!G64=\"\",\"\",Dateneingabe!G64)","v":""},{"$f":"IF(Dateneingabe!H64=\"\",\"\",Dateneingabe!H64)","v":""},{"$f":"IF(Dateneingabe!I64=\"\",\"\",Dateneingabe!I64)","v":""},null,null,null,null,null,null,null,null,null,null,null,0,""]
[{"$f":"IF(Dateneingabe!A65=\"\",\"\",Dateneingabe!A65)","v":""},{"$f":"IF(Dateneingabe!B65=\"\",\"\",Dateneingabe!B65)","v":""},{"$f":"IF(Dateneingabe!E65=\"\",\"\",Dateneingabe!E65)","v":""},{"$f":"IF(Dateneingabe!F65=\"\",\"\",Dateneingabe!F65)","v":""},{"$f":"IF(Dateneingabe!G65=\"\",\"\",Dateneingabe!G65)","v":""},{"$f":"IF(Dateneingabe!H65=\"\",\"\",Dateneingabe!H65)","v":""},{"$f":"IF(Dateneingabe!I65=\"\",\"\",Dateneingabe!I65)","v":""},null,null,null,null,null,null,null,null,null,null,null,0,""]
[{"$f":"IF(Dateneingabe!A66=\"\",\"\",Dateneingabe!A66)","v":""},{"$f":"IF(Dateneingabe!B66=\"\",\"\",Dateneingabe!B66)","v":""},{"$f":"IF(Dateneingabe!E66=\"\",\"\",Dateneingabe!E66)","v":""},{"$f":"IF(Dateneingabe!F66=\"\",\"\",Dateneingabe!F66)","v":""},{"$f":"IF(Dateneingabe!G66=\"\",\"\",Dateneingabe!G66)","v":""},{"$f":"IF(Dateneingabe!H66=\"\",\"\",Dateneingabe!H66)","v":""},{"$f":"IF(Dateneingabe!I66=\"\",\"\",Dateneingabe!I66)","v":""},null,null,null,null,null,null,null,null,null,null,null,0,""]
[{"$f":"IF(Dateneingabe!A67=\"\",\"\",Dateneingabe!A67)","v":""},{"$f":"IF(Dateneingabe!B67=\"\",\"\",Dateneingabe!B67)","v":""},{"$f":"IF(Dateneingabe!E67=\"\",\"\",Dateneingabe!E67)","v":""},{"$f":"IF(Dateneingabe!F67=\"\",\"\",Dateneingabe!F67)","v":""},{"$f":"IF(Dateneingabe!G67=\"\",\"\",Dateneingabe!G67)","v":""},{"$f":"IF(Dateneingabe!H67=\"\",\"\",Dateneingabe!H67)","v":""},{"$f":"IF(Dateneingabe!I67=\"\",\"\",Dateneingabe!I67)","v":""},null,null,null,null,null,null,null,null,null,null,null,0,""]
[{"$f":"IF(Dateneingabe!A68=\"\",\"\",Dateneingabe!A68)","v":""},{"$f":"IF(Dateneingabe!B68=\"\",\"\",Dateneingabe!B68)","v":""},{"$f":"IF(Dateneingabe!E68=\"\",\"\",Dateneingabe!E68)","v":""},{"$f":"IF(Dateneingabe!F68=\"\",\"\",Dateneingabe!F68)","v":""},{"$f":"IF(Dateneingabe!G68=\"\",\"\",Dateneingabe!G68)","v":""},{"$f":"IF(Dateneingabe!H68=\"\",\"\",Dateneingabe!H68)","v":""},{"$f":"IF(Dateneingabe!I68=\"\",\"\",Dateneingabe!I68)","v":""},null,null,null,null,null,null,null,null,null,null,null,0,""]
[{"$f":"IF(Dateneingabe!A69=\"\",\"\",Dateneingabe!A69)","v":""},{"$f":"IF(Dateneingabe!B69=\"\",\"\",Dateneingabe!B69)","v":""},{"$f":"IF(Dateneingabe!E69=\"\",\"\",Dateneingabe!E69)","v":""},{"$f":"IF(Dateneingabe!F69=\"\",\"\",Dateneingabe!F69)","v":""},{"$f":"IF(Dateneingabe!G69=\"\",\"\",Dateneingabe!G69)","v":""},{"$f":"IF(Dateneingabe!H69=\"\",\"\",Dateneingabe!H69)","v":""},{"$f":"IF(Dateneingabe!I69=\"\",\"\",Dateneingabe!I69)","v":""},null,null,null,null,null,null,null,null,null,null,null,0,""]
[{"$f":"'Hinweise - bitte beachten!!!'!A1:A1&\" - \"&'Hinweise - bitte beachten!!!'!A2:A2","v":"HSVRM Obedience Auswertung - Version 2019 v5.1 - erstellt von Sören Marquardt für den Hundesportverband Rhein-Main (HSVRM)"}]
[null,null,null,null,null,null,null,{"$f":"IF(H8=\"\",0,H8)","v":0},{"$f":"IF(I8=\"\",0,I8)","v":0},0,0,0,0,0,0,0,0,0,{"$f":"SUM(H27*$H$6+I27*$I$6+J27*$J$6+K27*$K$6+L27*$L$6+M27*$M$6+N27*$N$6+O27*$O$6+P27*$P$6+Q27*$Q$6+R27*$R$6)","v":0}]
[{"$f":"'Übersicht Übungen'!H35","v":256},{"$f":"'Übersicht Übungen'!I35","v":320},"Punkte","Punkte",null,null,null,{"$f":"IF(H9=\"\",0,H9)","v":0},0,0,0,0,0,0,0,0,0,0,0]
[{"$f":"'Übersicht Übungen'!H36","v":224},{"$f":"'Übersicht Übungen'!I36","v":255.5},0,0,null,null,null,0,0,0,0,0,0,0,0,0,0,0,0]
[{"$f":"'Übersicht Übungen'!H37","v":192},{"$f":"'Übersicht Übungen'!I37","v":223.5},5,5,null,null,null,0,0,0,0,0,0,0,0,0,0,0,0]
[{"$f":"'Übersicht Übungen'!H38","v":0},{"$f":"'Übersicht Übungen'!I38","v":191.5},5.25,5.5,null,null,null,0,0,0,0,0,0,0,0,0,0,0,0]
[null,null,5.5,6,null,null,null,0,0,0,0,0,0,0,0,0,0,0,0]
[null,null,5.75,6.5,null,null,null,0,0,0,0,0,0,0,0,0,0,0,0]
[null,null,6,7,null,null,null,0,0,0,0,0,0,0,0,0,0,0,0]
[null,null,6.25,7.5,null,null,null,0,0,0,0,0,0,0,0,0,0,0,0]
[null,null,6.5,8,null,null,null,0,0,0,0,0,0,0,0,0,0,0,0]
[null,null,6.75,8.5,null,null,null,0,0,0,0,0,0,0,0,0,0,0,0]
[null,null,7,9,null,null,null,0,0,0,0,0,0,0,0,0,0,0,0]
[null,null,7.25,9.5,null,null,null,0,0,0,0,0,0,0,0,0,0,0,0]
[null,null,7.5,10,null,null,null,0,0,0,0,0,0,0,0,0,0,0,0]
[null,null,7.75,null,null,null,null,0,0,0,0,0,0,0,0,0,0,0,0]
[null,null,8,null,null,null,null,0,0,0,0,0,0,0,0,0,0,0,0]
[null,null,8.25,null,null,null,null,0,0,0,0,0,0,0,0,0,0,0,0]
[null,null,8.5,null,null,null,null,{"$f":"IF(H25=\"\",0,H25)","v":0},0,0,0,0,0,0,0,0,0,0,0]
[null,null,8.75]
[null,null,9]
[null,null,9.25]
[null,null,9.5]
[null,null,9.75]
[null,null,10]

{"sheet":"Liste Klasse 3","index":8,"n_rows":50,"n_cols":44,"rows_kept":50,"cut":false,"hidden":false,"merged":[[0,0,0,3],[0,4,0,13],[0,14,0,20],[1,0,1,2],[1,3,1,5],[1,7,1,15],[1,18,1,20],[3,0,5,5],[5,22,5,23],[5,24,5,25],[5,26,5,27],[5,28,5,29],[5,42,5,43],[6,7,6,17],[5,38,5,39],[5,40,5,41],[5,30,5,31],[5,32,5,33],[5,34,5,35],[5,36,5,37]]}
["HSVRM Obedience:",null,null,null,{"$f":"Dateneingabe!C6&\"\"","v":"<Titel der Veranstaltung - z. B. Obedience-Prüfung>"},null,null,null,null,null,null,null,null,null,"FCI-Klasse 3"]
["Veranstaltender Verein:",null,null,{"$f":"Dateneingabe!C5","v":"<Veranstaltender Verein oder Verband>"},null,null,"Leistungsrichter:",{"$f":"Dateneingabe!I4","v":"<Name der Leistungsrichter>"},null,null,null,null,null,null,null,null,null,"Datum:",{"$f":"Dateneingabe!C7","v":"<Prüfungstag/e>"}]
[]
["Ergebnisliste",null,null,null,null,null,"Übung",{"$f":"'Übersicht Übungen'!$A48","v":1},{"$f":"'Übersicht Übungen'!$A49","v":2},{"$f":"'Übersicht Übungen'!$A50","v":3},{"$f":"'Übersicht Übungen'!$A51","v":4},{"$f":"'Übersicht Übungen'!$A52","v":5},{"$f":"'Übersicht Übungen'!$A53","v":6},{"$f":"'Übersicht Übungen'!$A54","v":7},{"$f":"'Übersicht Übungen'!$A55","v":8},{"$f":"'Übersicht Übungen'!$A56","v":9},{"$f":"'Übersicht Übungen'!$A57","v":10},"gelbe",null,null,null,null,"Eingabe der Bewertung nach Leistungsrichter:"]
[null,null,null,null,null,null,"Reihenfolge",{"$f":"'Übersicht Übungen'!$B48","v":1},{"$f":"'Übersicht Übungen'!$B49","v":2},{"$f":"'Übersicht Übungen'!$B50","v":3},{"$f":"'Übersicht Übungen'!$B51","v":4},{"$f":"'Übersicht Übungen'!$B52","v":5},{"$f":"'Übersicht Übungen'!$B53","v":6},{"$f":"'Übersicht Übungen'!$B54","v":7},{"$f":"'Übersicht Übungen'!$B55","v":8},{"$f":"'Übersicht Übungen'!$B56","v":9},{"$f":"'Übersicht Übungen'!$B57","v":10},"Karte"]
[null,null,null,null,null,null,"Koeffizient",{"$f":"'Übersicht Übungen'!$C48","v":2},{"$f":"'Übersicht Übungen'!$C49","v":2},{"$f":"'Übersicht Übungen'!$C50","v":3},{"$f":"'Übersicht Übungen'!$C51","v":3},{"$f":"'Übersicht Übungen'!$C52","v":4},{"$f":"'Übersicht Übungen'!$C53","v":4},{"$f":"'Übersicht Übungen'!$C54","v":3},{"$f":"'Übersicht Übungen'!$C55","v":4},{"$f":"'Übersicht Übungen'!$C56","v":3},{"$f":"'Übersicht Übungen'!$C57","v":4},{"$f":"'Übersicht Übungen'!$C58","v":0},null,null,null,null,{"$f":"\"Übung: \"&H$4","v":"Übung: 1"},null,{"$f":"\"Übung: \"&I$4","v":"Übung: 2"},null,{"$f":"\"Übung: \"&J$4","v":"Übung: 3"},null,{"$f":"\"Übung: \"&K$4","v":"Übung: 4"},null,{"$f":"\"Übung: \"&L$4","v":"Übung: 5"},null,{"$f":"\"Übung: \"&M$4","v":"Übung: 6"},null,{"$f":"\"Übung: \"&N$4","v":"Übung: 7"},null,{"$f":"\"Übung: \"&O$4","v":"Übung: 8"},null,{"$f":"\"Übung: \"&P$4","v":"Übung: 9"},null,{"$f":"\"Übung: \"&Q$4","v":"Übung: 10"},null,"Gelbe Karte"]
["Nr.","Los","Hundeführer/-in","Verein","Verband","Hund","Rasse","Auswertung",null,null,null,null,null,null,null,null,null,null,"Gesamt","WN","Platz",null,"LR 1","LR 2","LR 1","LR 2","LR 1","LR 2","LR 1","LR 2","LR 1","LR 2","LR 1","LR 2","LR 1","LR 2","LR 1","LR 2","LR 1","LR 2","LR 1","LR 2","LR 1","LR 2"]
[{"$f":"IF(Dateneingabe!A72=\"\",\"\",Dateneingabe!A72)","v":""},{"$f":"IF(Dateneingabe!B72=\"\",\"\",Dateneingabe!B72)","v":""},{"$f":"IF(Dateneingabe!E72=\"\",\"\",Dateneingabe!E72)","v":""},{"$f":"IF(Dateneingabe!F72=\"\",\"\",Dateneingabe!F72)","v":""},{"$f":"IF(Dateneingabe!G72=\"\",\"\",Dateneingabe!G72)","v":""},{"$f":"IF(Dateneingabe!H72=\"\",\"\",Dateneingabe!H72)","v":""},{"$f":"IF(Dateneingabe!I72=\"\",\"\",Dateneingabe!I72)","v":""},{"$f":"IF(AND(W8=\"\",X8=\"\"),\"\",IF(X8=\"\",W8,IF(W8=\"\",X8,((W8+X8)/2))))","v":""},{"$f":"IF(AND(Y8=\"\",Z8=\"\"),\"\",IF(Z8=\"\",Y8,IF(Y8=\"\",Z8,((Y8+Z8)/2))))","v":""},{"$f":"IF(AND(AA8=\"\",AB8=\"\"),\"\",IF(AB8=\"\",AA8,IF(AA8=\"\",AB8,((AA8+AB8)/2))))","v":""},{"$f":"IF(AND(AC8=\"\",AD8=\"\"),\"\",IF(AD8=\"\",AC8,IF(AC8=\"\",AD8,((AC8+AD8)/2))))","v":""},{"$f":"IF(AND(AE8=\"\",AF8=\"\"),\"\",IF(AF8=\"\",AE8,IF(AE8=\"\",AF8,((AE8+AF8)/2))))","v":""},{"$f":"IF(AND(AG8=\"\",AH8=\"\"),\"\",IF(AH8=\"\",AG8,IF(AG8=\"\",AH8,((AG8+AH8)/2))))","v":""},{"$f":"IF(AND(AI8=\"\",AJ8=\"\"),\"\",IF(AJ8=\"\",AI8,IF(AI8=\"\",AJ8,((AI8+AJ8)/2))))","v":""},{"$f":"IF(AND(AK8=\"\",AL8=\"\"),\"\",IF(AL8=\"\",AK8,IF(AK8=\"\",AL8,((AK8+AL8)/2))))","v":""},{"$f":"IF(AND(AM8=\"\",AN8=\"\"),\"\",IF(AN8=\"\",AM8,IF(AM8=\"\",AN8,((AM8+AN8)/2))))","v":""},{"$f":"IF(AND(AO8=\"\",AP8=\"\"),\"\",IF(AP8=\"\",AO8,IF(AO8=\"\",AP8,((AO8+AP8)/2))))","v":""},{"$f":"IF(OR(AQ8=\"X\",AR8=\"X\"),-10,0)","v":0},{"$f":"IF(S27=0,0,S27+R8)","v":0},{"$f":"IF(U8=\"DIS\",\"oAK\",IF(S8=0,\"\",IF(S8>$B$29,\"V\",IF(S8>$B$30,\"SG\",IF(S8>$B$31,\"G\",\"oAK\")))))","v":""}]
[{"$f":"IF(Dateneingabe!A73=\"\",\"\",Dateneingabe!A73)","v":""},{"$f":"IF(Dateneingabe!B73=\"\",\"\",Dateneingabe!B73)","v":""},{"$f":"IF(Dateneingabe!E73=\"\",\"\",Dateneingabe!E73)","v":""},{"$f":"IF(Dateneingabe!F73=\"\",\"\",Dateneingabe!F73)","v":""},{"$f":"IF(Dateneingabe!G73=\"\",\"\",Dateneingabe!G73)","v":""},{"$f":"IF(Dateneingabe!H73=\"\",\"\",Dateneingabe!H73)","v":""},{"$f":"IF(Dateneingabe!I73=\"\",\"\",Dateneingabe!I73)","v":""},{"$f":"IF(AND(W9=\"\",X9=\"\"),\"\",IF(X9=\"\",W9,IF(W9=\"\",X9,((W9+X9)/2))))","v":""},{"$f":"IF(AND(Y9=\"\",Z9=\"\"),\"\",IF(Z9=\"\",Y9,IF(Y9=\"\",Z9,((Y9+Z9)/2))))","v":""},{"$f":"IF(AND(AA9=\"\",AB9=\"\"),\"\",IF(AB9=\"\",AA9,IF(AA9=\"\",AB9,((AA9+AB9)/2))))","v":""},{"$f":"IF(AND(AC9=\"\",AD9=\"\"),\"\",IF(AD9=\"\",AC9,IF(AC9=\"\",AD9,((AC9+AD9)/2))))","v":""},{"$f":"IF(AND(AE9=\"\",AF9=\"\"),\"\",IF(AF9=\"\",AE9,IF(AE9=\"\",AF9,((AE9+AF9)/2))))","v":""},{"$f":"IF(AND(AG9=\"\",AH9=\"\"),\"\",IF(AH9=\"\",AG9,IF(AG9=\"\",AH9,((AG9+AH9)/2))))","v":""},{"$f":"IF(AND(AI9=\"\",AJ9=\"\"),\"\",IF(AJ9=\"\",AI9,IF(AI9=\"\",AJ9,((AI9+AJ9)/2))))","v":""},{"$f":"IF(AND(AK9=\"\",AL9=\"\"),\"\",IF(AL9=\"\",AK9,IF(AK9=\"\",AL9,((AK9+AL9)/2))))","v":""},{"$f":"IF(AND(AM9=\"\",AN9=\"\"),\"\",IF(AN9=\"\",AM9,IF(AM9=\"\",AN9,((AM9+AN9)/2))))","v":""},{"$f":"IF(AND(AO9=\"\",AP9=\"\"),\"\",IF(AP9=\"\",AO9,IF(AO9=\"\",AP9,((AO9+AP9)/2))))","v":""},{"$f":"IF(OR(AQ9=\"X\",AR9=\"X\"),-10,0)","v":0},{"$f":"IF(S28=0,0,S28+R9)","v":0},""]
[{"$f":"IF(Dateneingabe!A74=\"\",\"\",Dateneingabe!A74)","v":""},{"$f":"IF(Dateneingabe!B74=\"\",\"\",Dateneingabe!B74)","v":""},{"$f":"IF(Dateneingabe!E74=\"\",\"\",Dateneingabe!E74)","v":""},{"$f":"IF(Dateneingabe!F74=\"\",\"\",Dateneingabe!F74)","v":""},{"$f":"IF(Dateneingabe!G74=\"\",\"\",Dateneingabe!G74)","v":""},{"$f":"IF(Dateneingabe!H74=\"\",\"\",Dateneingabe!H74)","v":""},{"$f":"IF(Dateneingabe!I74=\"\",\"\",Dateneingabe!I74)","v":""},{"$f":"IF(AND(W10=\"\",X10=\"\"),\"\",IF(X10=\"\",W10,IF(W10=\"\",X10,((W10+X10)/2))))","v":""},{"$f":"IF(AND(Y10=\"\",Z10=\"\"),\"\",IF(Z10=\"\",Y10,IF(Y10=\"\",Z10,((Y10+Z10)/2))))","v":""},{"$f":"IF(AND(AA10=\"\",AB10=\"\"),\"\",IF(AB10=\"\",AA10,IF(AA10=\"\",AB10,((AA10+AB10)/2))))","v":""},{"$f":"IF(AND(AC10=\"\",AD10=\"\"),\"\",IF(AD10=\"\",AC10,IF(AC10=\"\",AD10,((AC10+AD10)/2))))","v":""},{"$f":"IF(AND(AE10=\"\",AF10=\"\"),\"\",IF(AF10=\"\",AE10,IF(AE10=\"\",AF10,((AE10+AF10)/2))))","v":""},{"$f":"IF(AND(AG10=\"\",AH10=\"\"),\"\",IF(AH10=\"\",AG10,IF(AG10=\"\",AH10,((AG10+AH10)/2))))","v":""},{"$f":"IF(AND(AI10=\"\",AJ10=\"\"),\"\",IF(AJ10=\"\",AI10,IF(AI10=\"\",AJ10,((AI10+AJ10)/2))))","v":""},{"$f":"IF(AND(AK10=\"\",AL10=\"\"),\"\",IF(AL10=\"\",AK10,IF(AK10=\"\",AL10,((AK10+AL10)/2))))","v":""},{"$f":"IF(AND(AM10=\"\",AN10=\"\"),\"\",IF(AN10=\"\",AM10,IF(AM10=\"\",AN10,((AM10+AN10)/2))))","v":""},{"$f":"IF(AND(AO10=\"\",AP10=\"\"),\"\",IF(AP10=\"\",AO10,IF(AO10=\"\",AP10,((AO10+AP10)/2))))","v":""},0,0,""]
[{"$f":"IF(Dateneingabe!A75=\"\",\"\",Dateneingabe!A75)","v":""},{"$f":"IF(Dateneingabe!B75=\"\",\"\",Dateneingabe!B75)","v":""},{"$f":"IF(Dateneingabe!E75=\"\",\"\",Dateneingabe!E75)","v":""},{"$f":"IF(Dateneingabe!F75=\"\",\"\",Dateneingabe!F75)","v":""},{"$f":"IF(Dateneingabe!G75=\"\",\"\",Dateneingabe!G75)","v":""},{"$f":"IF(Dateneingabe!H75=\"\",\"\",Dateneingabe!H75)","v":""},{"$f":"IF(Dateneingabe!I75=\"\",\"\",Dateneingabe!I75)","v":""},"","","",{"$f":"IF(AND(AC11=\"\",AD11=\"\"),\"\",IF(AD11=\"\",AC11,IF(AC11=\"\",AD11,((AC11+AD11)/2))))","v":""},"","","","","","",0,0,""]
[{"$f":"IF(Dateneingabe!A76=\"\",\"\",Dateneingabe!A76)","v":""},{"$f":"IF(Dateneingabe!B76=\"\",\"\",Dateneingabe!B76)","v":""},{"$f":"IF(Dateneingabe!E76=\"\",\"\",Dateneingabe!E76)","v":""},{"$f":"IF(Dateneingabe!F76=\"\",\"\",Dateneingabe!F76)","v":""},{"$f":"IF(Dateneingabe!G76=\"\",\"\",Dateneingabe!G76)","v":""},{"$f":"IF(Dateneingabe!H76=\"\",\"\",Dateneingabe!H76)","v":""},{"$f":"IF(Dateneingabe!I76=\"\",\"\",Dateneingabe!I76)","v":""},"","","","","","","","","","",0,0,""]
[{"$f":"IF(Dateneingabe!A77=\"\",\"\",Dateneingabe!A77)","v":""},{"$f":"IF(Dateneingabe!B77=\"\",\"\",Dateneingabe!B77)","v":""},{"$f":"IF(Dateneingabe!E77=\"\",\"\",Dateneingabe!E77)","v":""},{"$f":"IF(Dateneingabe!F77=\"\",\"\",Dateneingabe!F77)","v":""},{"$f":"IF(Dateneingabe!G77=\"\",\"\",Dateneingabe!G77)","v":""},{"$f":"IF(Dateneingabe!H77=\"\",\"\",Dateneingabe!H77)","v":""},{"$f":"IF(Dateneingabe!I77=\"\",\"\",Dateneingabe!I77)","v":""},"","","","","","","","","","",0,0,""]
[{"$f":"IF(Dateneingabe!A78=\"\",\"\",Dateneingabe!A78)","v":""},{"$f":"IF(Dateneingabe!B78=\"\",\"\",Dateneingabe!B78)","v":""},{"$f":"IF(Dateneingabe!E78=\"\",\"\",Dateneingabe!E78)","v":""},{"$f":"IF(Dateneingabe!F78=\"\",\"\",Dateneingabe!F78)","v":""},{"$f":"IF(Dateneingabe!G78=\"\",\"\",Dateneingabe!G78)","v":""},{"$f":"IF(Dateneingabe!H78=\"\",\"\",Dateneingabe!H78)","v":""},{"$f":"IF(Dateneingabe!I78=\"\",\"\",Dateneingabe!I78)","v":""},"","","","","","","","","","",0,0,""]
[{"$f":"IF(Dateneingabe!A79=\"\",\"\",Dateneingabe!A79)","v":""},{"$f":"IF(Dateneingabe!B79=\"\",\"\",Dateneingabe!B79)","v":""},{"$f":"IF(Dateneingabe!E79=\"\",\"\",Dateneingabe!E79)","v":""},{"$f":"IF(Dateneingabe!F79=\"\",\"\",Dateneingabe!F79)","v":""},{"$f":"IF(Dateneingabe!G79=\"\",\"\",Dateneingabe!G79)","v":""},{"$f":"IF(Dateneingabe!H79=\"\",\"\",Dateneingabe!H79)","v":""},{"$f":"IF(Dateneingabe!I79=\"\",\"\",Dateneingabe!I79)","v":""},"","","","","","","","","","",0,0,""]
[{"$f":"IF(Dateneingabe!A80=\"\",\"\",Dateneingabe!A80)","v":""},{"$f":"IF(Dateneingabe!B80=\"\",\"\",Dateneingabe!B80)","v":""},{"$f":"IF(Dateneingabe!E80=\"\",\"\",Dateneingabe!E80)","v":""},{"$f":"IF(Dateneingabe!F80=\"\",\"\",Dateneingabe!F80)","v":""},{"$f":"IF(Dateneingabe!G80=\"\",\"\",Dateneingabe!G80)","v":""},{"$f":"IF(Dateneingabe!H80=\"\",\"\",Dateneingabe!H80)","v":""},{"$f":"IF(Dateneingabe!I80=\"\",\"\",Dateneingabe!I80)","v":""},"","","","","","","","","","",0,0,""]
[{"$f":"IF(Dateneingabe!A81=\"\",\"\",Dateneingabe!A81)","v":""},{"$f":"IF(Dateneingabe!B81=\"\",\"\",Dateneingabe!B81)","v":""},{"$f":"IF(Dateneingabe!E81=\"\",\"\",Dateneingabe!E81)","v":""},{"$f":"IF(Dateneingabe!F81=\"\",\"\",Dateneingabe!F81)","v":""},{"$f":"IF(Dateneingabe!G81=\"\",\"\",Dateneingabe!G81)","v":""},{"$f":"IF(Dateneingabe!H81=\"\",\"\",Dateneingabe!H81)","v":""},{"$f":"IF(Dateneingabe!I81=\"\",\"\",Dateneingabe!I81)","v":""},"","","","","","","","","","",0,0,""]
[{"$f":"IF(Dateneingabe!A82=\"\",\"\",Dateneingabe!A82)","v":""},{"$f":"IF(Dateneingabe!B82=\"\",\"\",Dateneingabe!B82)","v":""},{"$f":"IF(Dateneingabe!E82=\"\",\"\",Dateneingabe!E82)","v":""},{"$f":"IF(Dateneingabe!F82=\"\",\"\",Dateneingabe!F82)","v":""},{"$f":"IF(Dateneingabe!G82=\"\",\"\",Dateneingabe!G82)","v":""},{"$f":"IF(Dateneingabe!H82=\"\",\"\",Dateneingabe!H82)","v":""},{"$f":"IF(Dateneingabe!I82=\"\",\"\",Dateneingabe!I82)","v":""},"","","","","","","","","","",0,0,""]
[{"$f":"IF(Dateneingabe!A83=\"\",\"\",Dateneingabe!A83)","v":""},{"$f":"IF(Dateneingabe!B83=\"\",\"\",Dateneingabe!B83)","v":""},{"$f":"IF(Dateneingabe!E83=\"\",\"\",Dateneingabe!E83)","v":""},{"$f":"IF(Dateneingabe!F83=\"\",\"\",Dateneingabe!F83)","v":""},{"$f":"IF(Dateneingabe!G83=\"\",\"\",Dateneingabe!G83)","v":""},{"$f":"IF(Dateneingabe!H83=\"\",\"\",Dateneingabe!H83)","v":""},{"$f":"IF(Dateneingabe!I83=\"\",\"\",Dateneingabe!I83)","v":""},"","","","","","","","","","",0,0,""]
[{"$f":"IF(Dateneingabe!A84=\"\",\"\",Dateneingabe!A84)","v":""},{"$f":"IF(Dateneingabe!B84=\"\",\"\",Dateneingabe!B84)","v":""},{"$f":"IF(Dateneingabe!E84=\"\",\"\",Dateneingabe!E84)","v":""},{"$f":"IF(Dateneingabe!F84=\"\",\"\",Dateneingabe!F84)","v":""},{"$f":"IF(Dateneingabe!G84=\"\",\"\",Dateneingabe!G84)","v":""},{"$f":"IF(Dateneingabe!H84=\"\",\"\",Dateneingabe!H84)","v":""},{"$f":"IF(Dateneingabe!I84=\"\",\"\",Dateneingabe!I84)","v":""},"","","","","","","","","","",0,0,""]
[{"$f":"IF(Dateneingabe!A85=\"\",\"\",Dateneingabe!A85)","v":""},{"$f":"IF(Dateneingabe!B85=\"\",\"\",Dateneingabe!B85)","v":""},{"$f":"IF(Dateneingabe!E85=\"\",\"\",Dateneingabe!E85)","v":""},{"$f":"IF(Dateneingabe!F85=\"\",\"\",Dateneingabe!F85)","v":""},{"$f":"IF(Dateneingabe!G85=\"\",\"\",Dateneingabe!G85)","v":""},{"$f":"IF(Dateneingabe!H85=\"\",\"\",Dateneingabe!H85)","v":""},{"$f":"IF(Dateneingabe!I85=\"\",\"\",Dateneingabe!I85)","v":""},"","","","","","","","","","",0,0,""]
[{"$f":"IF(Dateneingabe!A86=\"\",\"\",Dateneingabe!A86)","v":""},{"$f":"IF(Dateneingabe!B86=\"\",\"\",Dateneingabe!B86)","v":""},{"$f":"IF(Dateneingabe!E86=\"\",\"\",Dateneingabe!E86)","v":""},{"$f":"IF(Dateneingabe!F86=\"\",\"\",Dateneingabe!F86)","v":""},{"$f":"IF(Dateneingabe!G86=\"\",\"\",Dateneingabe!G86)","v":""},{"$f":"IF(Dateneingabe!H86=\"\",\"\",Dateneingabe!H86)","v":""},{"$f":"IF(Dateneingabe!I86=\"\",\"\",Dateneingabe!I86)","v":""},"","","","","","","","","","",0,0,""]
[{"$f":"IF(Dateneingabe!A87=\"\",\"\",Dateneingabe!A87)","v":""},{"$f":"IF(Dateneingabe!B87=\"\",\"\",Dateneingabe!B87)","v":""},{"$f":"IF(Dateneingabe!E87=\"\",\"\",Dateneingabe!E87)","v":""},{"$f":"IF(Dateneingabe!F87=\"\",\"\",Dateneingabe!F87)","v":""},{"$f":"IF(Dateneingabe!G87=\"\",\"\",Dateneingabe!G87)","v":""},{"$f":"IF(Dateneingabe!H87=\"\",\"\",Dateneingabe!H87)","v":""},{"$f":"IF(Dateneingabe!I87=\"\",\"\",Dateneingabe!I87)","v":""},"","","","","","","","","","",0,0,""]
[{"$f":"IF(Dateneingabe!A88=\"\",\"\",Dateneingabe!A88)","v":""},{"$f":"IF(Dateneingabe!B88=\"\",\"\",Dateneingabe!B88)","v":""},{"$f":"IF(Dateneingabe!E88=\"\",\"\",Dateneingabe!E88)","v":""},{"$f":"IF(Dateneingabe!F88=\"\",\"\",Dateneingabe!F88)","v":""},{"$f":"IF(Dateneingabe!G88=\"\",\"\",Dateneingabe!G88)","v":""},{"$f":"IF(Dateneingabe!H88=\"\",\"\",Dateneingabe!H88)","v":""},{"$f":"IF(Dateneingabe!I88=\"\",\"\",Dateneingabe!I88)","v":""},"","","","","","","","","","",0,0,""]
[{"$f":"IF(Dateneingabe!A89=\"\",\"\",Dateneingabe!A89)","v":""},{"$f":"IF(Dateneingabe!B89=\"\",\"\",Dateneingabe!B89)","v":""},{"$f":"IF(Dateneingabe!E89=\"\",\"\",Dateneingabe!E89)","v":""},{"$f":"IF(Dateneingabe!F89=\"\",\"\",Dateneingabe!F89)","v":""},{"$f":"IF(Dateneingabe!G89=\"\",\"\",Dateneingabe!G89)","v":""},{"$f":"IF(Dateneingabe!H89=\"\",\"\",Dateneingabe!H89)","v":""},{"$f":"IF(Dateneingabe!I89=\"\",\"\",Dateneingabe!I89)","v":""},"","","","","","","","","","",0,0,""]
[{"$f":"'Hinweise - bitte beachten!!!'!A1:A1&\" - \"&'Hinweise - bitte beachten!!!'!A2:A2","v":"HSVRM Obedience Auswertung - Version 2019 v5.1 - erstellt von Sören Marquardt für den Hundesportverband Rhein-Main (HSVRM)"}]
[null,null,null,null,null,null,null,{"$f":"IF(H8=\"\",0,H8)","v":0},{"$f":"IF(I8=\"\",0,I8)","v":0},0,0,0,0,0,0,0,0,0,{"$f":"SUM(H27*$H$6+I27*$I$6+J27*$J$6+K27*$K$6+L27*$L$6+M27*$M$6+N27*$N$6+O27*$O$6+P27*$P$6+Q27*$Q$6+R27*$R$6)","v":0}]
[{"$f":"'Übersicht Übungen'!H49","v":256},{"$f":"'Übersicht Übungen'!I49","v":320},"Punkte","Punkte",null,null,null,0,{"$f":"IF(I9=\"\",0,I9)","v":0},0,0,0,0,0,0,0,0,0,0]
[{"$f":"'Übersicht Übungen'!H50","v":224},{"$f":"'Übersicht Übungen'!I50","v":255.5},0,0,null,null,null,0,{"$f":"IF(I10=\"\",0,I10)","v":0},0,0,0,0,0,0,0,0,0,0]
[{"$f":"'Übersicht Übungen'!H51","v":192},{"$f":"'Übersicht Übungen'!I51","v":223.5},5,5,null,null,null,0,{"$f":"IF(I11=\"\",0,I11)","v":0},0,0,0,0,0,0,0,0,0,0]
[{"$f":"'Übersicht Übungen'!H52","v":0},{"$f":"'Übersicht Übungen'!I52","v":191.5},5.25,5.5,null,null,null,0,{"$f":"IF(I12=\"\",0,I12)","v":0},0,0,0,0,0,0,0,0,0,0]
["X",null,5.5,6,null,null,null,0,{"$f":"IF(I13=\"\",0,I13)","v":0},0,0,0,0,0,0,0,0,0,0]
[null,null,5.75,6.5,null,null,null,0,{"$f":"IF(I14=\"\",0,I14)","v":0},0,0,0,0,0,0,0,0,0,0]
[null,null,6,7,null,null,null,0,{"$f":"IF(I15=\"\",0,I15)","v":0},0,0,0,0,0,0,0,0,0,0]
[null,null,6.25,7.5,null,null,null,0,{"$f":"IF(I16=\"\",0,I16)","v":0},0,0,0,0,0,0,0,0,0,0]
[null,null,6.5,8,null,null,null,0,{"$f":"IF(I17=\"\",0,I17)","v":0},0,0,0,0,0,0,0,0,0,0]
[null,null,6.75,8.5,null,null,null,0,{"$f":"IF(I18=\"\",0,I18)","v":0},0,0,0,0,0,0,0,0,0,0]
[null,null,7,9,null,null,null,0,{"$f":"IF(I19=\"\",0,I19)","v":0},0,0,0,0,0,0,0,0,0,0]
[null,null,7.25,9.5,null,null,null,0,{"$f":"IF(I20=\"\",0,I20)","v":0},0,0,0,0,0,0,0,0,0,0]
[null,null,7.5,10,null,null,null,0,{"$f":"IF(I21=\"\",0,I21)","v":0},0,0,0,0,0,0,0,0,0,0]
[null,null,7.75,null,null,null,null,0,{"$f":"IF(I22=\"\",0,I22)","v":0},0,0,0,0,0,0,0,0,0,0]
[null,null,8,null,null,null,null,0,{"$f":"IF(I23=\"\",0,I23)","v":0},0,0,0,0,0,0,0,0,0,0]
[null,null,8.25,null,null,null,null,0,{"$f":"IF(I24=\"\",0,I24)","v":0},0,0,0,0,0,0,0,0,0,0]
[null,null,8.5,null,null,null,null,0,{"$f":"IF(I25=\"\",0,I25)","v":0},0,0,0,0,0,0,0,0,0,0]
[null,null,8.75]
[null,null,9]
[null,null,9.25]
[null,null,9.5]
[null,null,9.75]
[null,null,10]

{"sheet":"Liste Klasse S","index":9,"n_rows":50,"n_cols":21,"rows_kept":50,"cut":false,"hidden":false,"merged":[[3,0,5,5],[6,7,6,17],[0,0,0,3],[0,4,0,13],[0,14,0,20],[1,0,1,2],[1,3,1,5],[1,7,1,15],[1,18,1,20]]}
["HSVRM Obedience:",null,null,null,{"$f":"Dateneingabe!C6&\"\"","v":"<Titel der Veranstaltung - z. B. Obedience-Prüfung>"},null,null,null,null,null,null,null,null,null,"Klasse S"]
["Veranstaltender Verein:",null,null,{"$f":"Dateneingabe!C5","v":"<Veranstaltender Verein oder Verband>"},null,null,"Leistungsrichter:",{"$f":"Dateneingabe!I4","v":"<Name der Leistungsrichter>"},null,null,null,null,null,null,null,null,null,"Datum:",{"$f":"Dateneingabe!C7","v":"<Prüfungstag/e>"}]
[]
["Ergebnisliste",null,null,null,null,null,"Übung",{"$f":"'Übersicht Übungen'!$A62","v":1},{"$f":"'Übersicht Übungen'!$A63","v":2},{"$f":"'Übersicht Übungen'!$A64","v":3},{"$f":"'Übersicht Übungen'!$A65","v":4},{"$f":"'Übersicht Übungen'!$A66","v":5},{"$f":"'Übersicht Übungen'!$A67","v":6},{"$f":"'Übersicht Übungen'!$A68","v":7},{"$f":"'Übersicht Übungen'!$A69","v":8},{"$f":"'Übersicht Übungen'!$A70","v":9},{"$f":"'Übersicht Übungen'!$A71","v":10},{"$f":"'Übersicht Übungen'!$A72","v":0}]
[null,null,null,null,null,null,"Reihenfolge",{"$f":"'Übersicht Übungen'!$B62","v":1},{"$f":"'Übersicht Übungen'!$B63","v":2},{"$f":"'Übersicht Übungen'!$B64","v":3},{"$f":"'Übersicht Übungen'!$B65","v":4},{"$f":"'Übersicht Übungen'!$B66","v":5},{"$f":"'Übersicht Übungen'!$B67","v":6},{"$f":"'Übersicht Übungen'!$B68","v":7},{"$f":"'Übersicht Übungen'!$B69","v":8},{"$f":"'Übersicht Übungen'!$B70","v":9},{"$f":"'Übersicht Übungen'!$B71","v":10},{"$f":"'Übersicht Übungen'!$B72","v":0}]
[null,null,null,null,null,null,"Koeffizient",{"$f":"'Übersicht Übungen'!$C62","v":4},{"$f":"'Übersicht Übungen'!$C63","v":3},{"$f":"'Übersicht Übungen'!$C64","v":3},{"$f":"'Übersicht Übungen'!$C65","v":3},{"$f":"'Übersicht Übungen'!$C66","v":4},{"$f":"'Übersicht Übungen'!$C67","v":3},{"$f":"'Übersicht Übungen'!$C68","v":2},{"$f":"'Übersicht Übungen'!$C69","v":4},{"$f":"'Übersicht Übungen'!$C70","v":4},{"$f":"'Übersicht Übungen'!$C71","v":2},{"$f":"'Übersicht Übungen'!$C72","v":0}]
["Nr.","Los","Hundeführer/-in","Verein","Verband","Hund","Rasse","Auswertung",null,null,null,null,null,null,null,null,null,null,"Gesamt","WN","Platz"]
[{"$f":"IF(Dateneingabe!A92=\"\",\"\",Dateneingabe!A92)","v":""},{"$f":"IF(Dateneingabe!B92=\"\",\"\",Dateneingabe!B92)","v":""},{"$f":"IF(Dateneingabe!E92=\"\",\"\",Dateneingabe!E92)","v":""},{"$f":"IF(Dateneingabe!F92=\"\",\"\",Dateneingabe!F92)","v":""},{"$f":"IF(Dateneingabe!G92=\"\",\"\",Dateneingabe!G92)","v":""},{"$f":"IF(Dateneingabe!H92=\"\",\"\",Dateneingabe!H92)","v":""},{"$f":"IF(Dateneingabe!I92=\"\",\"\",Dateneingabe!I92)","v":""},null,null,null,null,null,null,null,null,null,null,null,{"$f":"S27","v":0},{"$f":"IF(U8=\"DIS\",\"oAK\",IF(S8=0,\"\",IF(S8>$B$29,\"V\",IF(S8>$B$30,\"SG\",IF(S8>$B$31,\"G\",\"oAK\")))))","v":""}]
[{"$f":"IF(Dateneingabe!A93=\"\",\"\",Dateneingabe!A93)","v":""},{"$f":"IF(Dateneingabe!B93=\"\",\"\",Dateneingabe!B93)","v":""},{"$f":"IF(Dateneingabe!E93=\"\",\"\",Dateneingabe!E93)","v":""},{"$f":"IF(Dateneingabe!F93=\"\",\"\",Dateneingabe!F93)","v":""},{"$f":"IF(Dateneingabe!G93=\"\",\"\",Dateneingabe!G93)","v":""},{"$f":"IF(Dateneingabe!H93=\"\",\"\",Dateneingabe!H93)","v":""},{"$f":"IF(Dateneingabe!I93=\"\",\"\",Dateneingabe!I93)","v":""},null,null,null,null,null,null,null,null,null,null,null,0,""]
[{"$f":"IF(Dateneingabe!A94=\"\",\"\",Dateneingabe!A94)","v":""},{"$f":"IF(Dateneingabe!B94=\"\",\"\",Dateneingabe!B94)","v":""},{"$f":"IF(Dateneingabe!E94=\"\",\"\",Dateneingabe!E94)","v":""},{"$f":"IF(Dateneingabe!F94=\"\",\"\",Dateneingabe!F94)","v":""},{"$f":"IF(Dateneingabe!G94=\"\",\"\",Dateneingabe!G94)","v":""},{"$f":"IF(Dateneingabe!H94=\"\",\"\",Dateneingabe!H94)","v":""},{"$f":"IF(Dateneingabe!I94=\"\",\"\",Dateneingabe!I94)","v":""},null,null,null,null,null,null,null,null,null,null,null,0,""]
[{"$f":"IF(Dateneingabe!A95=\"\",\"\",Dateneingabe!A95)","v":""},{"$f":"IF(Dateneingabe!B95=\"\",\"\",Dateneingabe!B95)","v":""},{"$f":"IF(Dateneingabe!E95=\"\",\"\",Dateneingabe!E95)","v":""},{"$f":"IF(Dateneingabe!F95=\"\",\"\",Dateneingabe!F95)","v":""},{"$f":"IF(Dateneingabe!G95=\"\",\"\",Dateneingabe!G95)","v":""},{"$f":"IF(Dateneingabe!H95=\"\",\"\",Dateneingabe!H95)","v":""},{"$f":"IF(Dateneingabe!I95=\"\",\"\",Dateneingabe!I95)","v":""},null,null,null,null,null,null,null,null,null,null,null,0,""]
[{"$f":"IF(Dateneingabe!A96=\"\",\"\",Dateneingabe!A96)","v":""},{"$f":"IF(Dateneingabe!B96=\"\",\"\",Dateneingabe!B96)","v":""},{"$f":"IF(Dateneingabe!E96=\"\",\"\",Dateneingabe!E96)","v":""},{"$f":"IF(Dateneingabe!F96=\"\",\"\",Dateneingabe!F96)","v":""},{"$f":"IF(Dateneingabe!G96=\"\",\"\",Dateneingabe!G96)","v":""},{"$f":"IF(Dateneingabe!H96=\"\",\"\",Dateneingabe!H96)","v":""},{"$f":"IF(Dateneingabe!I96=\"\",\"\",Dateneingabe!I96)","v":""},null,null,null,null,null,null,null,null,null,null,null,0,""]
[{"$f":"IF(Dateneingabe!A97=\"\",\"\",Dateneingabe!A97)","v":""},{"$f":"IF(Dateneingabe!B97=\"\",\"\",Dateneingabe!B97)","v":""},{"$f":"IF(Dateneingabe!E97=\"\",\"\",Dateneingabe!E97)","v":""},{"$f":"IF(Dateneingabe!F97=\"\",\"\",Dateneingabe!F97)","v":""},{"$f":"IF(Dateneingabe!G97=\"\",\"\",Dateneingabe!G97)","v":""},{"$f":"IF(Dateneingabe!H97=\"\",\"\",Dateneingabe!H97)","v":""},{"$f":"IF(Dateneingabe!I97=\"\",\"\",Dateneingabe!I97)","v":""},null,null,null,null,null,null,null,null,null,null,null,0,""]
[{"$f":"IF(Dateneingabe!A98=\"\",\"\",Dateneingabe!A98)","v":""},{"$f":"IF(Dateneingabe!B98=\"\",\"\",Dateneingabe!B98)","v":""},{"$f":"IF(Dateneingabe!E98=\"\",\"\",Dateneingabe!E98)","v":""},{"$f":"IF(Dateneingabe!F98=\"\",\"\",Dateneingabe!F98)","v":""},{"$f":"IF(Dateneingabe!G98=\"\",\"\",Dateneingabe!G98)","v":""},{"$f":"IF(Dateneingabe!H98=\"\",\"\",Dateneingabe!H98)","v":""},{"$f":"IF(Dateneingabe!I98=\"\",\"\",Dateneingabe!I98)","v":""},null,null,null,null,null,null,null,null,null,null,null,0,""]
[{"$f":"IF(Dateneingabe!A99=\"\",\"\",Dateneingabe!A99)","v":""},{"$f":"IF(Dateneingabe!B99=\"\",\"\",Dateneingabe!B99)","v":""},{"$f":"IF(Dateneingabe!E99=\"\",\"\",Dateneingabe!E99)","v":""},{"$f":"IF(Dateneingabe!F99=\"\",\"\",Dateneingabe!F99)","v":""},{"$f":"IF(Dateneingabe!G99=\"\",\"\",Dateneingabe!G99)","v":""},{"$f":"IF(Dateneingabe!H99=\"\",\"\",Dateneingabe!H99)","v":""},{"$f":"IF(Dateneingabe!I99=\"\",\"\",Dateneingabe!I99)","v":""},null,null,null,null,null,null,null,null,null,null,null,0,""]
[{"$f":"IF(Dateneingabe!A100=\"\",\"\",Dateneingabe!A100)","v":""},{"$f":"IF(Dateneingabe!B100=\"\",\"\",Dateneingabe!B100)","v":""},{"$f":"IF(Dateneingabe!E100=\"\",\"\",Dateneingabe!E100)","v":""},{"$f":"IF(Dateneingabe!F100=\"\",\"\",Dateneingabe!F100)","v":""},{"$f":"IF(Dateneingabe!G100=\"\",\"\",Dateneingabe!G100)","v":""},{"$f":"IF(Dateneingabe!H100=\"\",\"\",Dateneingabe!H100)","v":""},{"$f":"IF(Dateneingabe!I100=\"\",\"\",Dateneingabe!I100)","v":""},null,null,null,null,null,null,null,null,null,null,null,0,""]
[{"$f":"IF(Dateneingabe!A101=\"\",\"\",Dateneingabe!A101)","v":""},{"$f":"IF(Dateneingabe!B101=\"\",\"\",Dateneingabe!B101)","v":""},{"$f":"IF(Dateneingabe!E101=\"\",\"\",Dateneingabe!E101)","v":""},{"$f":"IF(Dateneingabe!F101=\"\",\"\",Dateneingabe!F101)","v":""},{"$f":"IF(Dateneingabe!G101=\"\",\"\",Dateneingabe!G101)","v":""},{"$f":"IF(Dateneingabe!H101=\"\",\"\",Dateneingabe!H101)","v":""},{"$f":"IF(Dateneingabe!I101=\"\",\"\",Dateneingabe!I101)","v":""},null,null,null,null,null,null,null,null,null,null,null,0,""]
[{"$f":"IF(Dateneingabe!A102=\"\",\"\",Dateneingabe!A102)","v":""},{"$f":"IF(Dateneingabe!B102=\"\",\"\",Dateneingabe!B102)","v":""},{"$f":"IF(Dateneingabe!E102=\"\",\"\",Dateneingabe!E102)","v":""},{"$f":"IF(Dateneingabe!F102=\"\",\"\",Dateneingabe!F102)","v":""},{"$f":"IF(Dateneingabe!G102=\"\",\"\",Dateneingabe!G102)","v":""},{"$f":"IF(Dateneingabe!H102=\"\",\"\",Dateneingabe!H102)","v":""},{"$f":"IF(Dateneingabe!I102=\"\",\"\",Dateneingabe!I102)","v":""},null,null,null,null,null,null,null,null,null,null,null,0,""]
[{"$f":"IF(Dateneingabe!A103=\"\",\"\",Dateneingabe!A103)","v":""},{"$f":"IF(Dateneingabe!B103=\"\",\"\",Dateneingabe!B103)","v":""},{"$f":"IF(Dateneingabe!E103=\"\",\"\",Dateneingabe!E103)","v":""},{"$f":"IF(Dateneingabe!F103=\"\",\"\",Dateneingabe!F103)","v":""},{"$f":"IF(Dateneingabe!G103=\"\",\"\",Dateneingabe!G103)","v":""},{"$f":"IF(Dateneingabe!H103=\"\",\"\",Dateneingabe!H103)","v":""},{"$f":"IF(Dateneingabe!I103=\"\",\"\",Dateneingabe!I103)","v":""},null,null,null,null,null,null,null,null,null,null,null,0,""]
[{"$f":"IF(Dateneingabe!A104=\"\",\"\",Dateneingabe!A104)","v":""},{"$f":"IF(Dateneingabe!B104=\"\",\"\",Dateneingabe!B104)","v":""},{"$f":"IF(Dateneingabe!E104=\"\",\"\",Dateneingabe!E104)","v":""},{"$f":"IF(Dateneingabe!F104=\"\",\"\",Dateneingabe!F104)","v":""},{"$f":"IF(Dateneingabe!G104=\"\",\"\",Dateneingabe!G104)","v":""},{"$f":"IF(Dateneingabe!H104=\"\",\"\",Dateneingabe!H104)","v":""},{"$f":"IF(Dateneingabe!I104=\"\",\"\",Dateneingabe!I104)","v":""},null,null,null,null,null,null,null,null,null,null,null,0,""]
[{"$f":"IF(Dateneingabe!A105=\"\",\"\",Dateneingabe!A105)","v":""},{"$f":"IF(Dateneingabe!B105=\"\",\"\",Dateneingabe!B105)","v":""},{"$f":"IF(Dateneingabe!E105=\"\",\"\",Dateneingabe!E105)","v":""},{"$f":"IF(Dateneingabe!F105=\"\",\"\",Dateneingabe!F105)","v":""},{"$f":"IF(Dateneingabe!G105=\"\",\"\",Dateneingabe!G105)","v":""},{"$f":"IF(Dateneingabe!H105=\"\",\"\",Dateneingabe!H105)","v":""},{"$f":"IF(Dateneingabe!I105=\"\",\"\",Dateneingabe!I105)","v":""},null,null,null,null,null,null,null,null,null,null,null,0,""]
[{"$f":"IF(Dateneingabe!A106=\"\",\"\",Dateneingabe!A106)","v":""},{"$f":"IF(Dateneingabe!B106=\"\",\"\",Dateneingabe!B106)","v":""},{"$f":"IF(Dateneingabe!E106=\"\",\"\",Dateneingabe!E106)","v":""},{"$f":"IF(Dateneingabe!F106=\"\",\"\",Dateneingabe!F106)","v":""},{"$f":"IF(Dateneingabe!G106=\"\",\"\",Dateneingabe!G106)","v":""},{"$f":"IF(Dateneingabe!H106=\"\",\"\",Dateneingabe!H106)","v":""},{"$f":"IF(Dateneingabe!I106=\"\",\"\",Dateneingabe!I106)","v":""},null,null,null,null,null,null,null,null,null,null,null,0,""]
[{"$f":"IF(Dateneingabe!A107=\"\",\"\",Dateneingabe!A107)","v":""},{"$f":"IF(Dateneingabe!B107=\"\",\"\",Dateneingabe!B107)","v":""},{"$f":"IF(Dateneingabe!E107=\"\",\"\",Dateneingabe!E107)","v":""},{"$f":"IF(Dateneingabe!F107=\"\",\"\",Dateneingabe!F107)","v":""},{"$f":"IF(Dateneingabe!G107=\"\",\"\",Dateneingabe!G107)","v":""},{"$f":"IF(Dateneingabe!H107=\"\",\"\",Dateneingabe!H107)","v":""},{"$f":"IF(Dateneingabe!I107=\"\",\"\",Dateneingabe!I107)","v":""},null,null,null,null,null,null,null,null,null,null,null,0,""]
[{"$f":"IF(Dateneingabe!A108=\"\",\"\",Dateneingabe!A108)","v":""},{"$f":"IF(Dateneingabe!B108=\"\",\"\",Dateneingabe!B108)","v":""},{"$f":"IF(Dateneingabe!E108=\"\",\"\",Dateneingabe!E108)","v":""},{"$f":"IF(Dateneingabe!F108=\"\",\"\",Dateneingabe!F108)","v":""},{"$f":"IF(Dateneingabe!G108=\"\",\"\",Dateneingabe!G108)","v":""},{"$f":"IF(Dateneingabe!H108=\"\",\"\",Dateneingabe!H108)","v":""},{"$f":"IF(Dateneingabe!I108=\"\",\"\",Dateneingabe!I108)","v":""},null,null,null,null,null,null,null,null,null,null,null,0,""]
[{"$f":"IF(Dateneingabe!A109=\"\",\"\",Dateneingabe!A109)","v":""},{"$f":"IF(Dateneingabe!B109=\"\",\"\",Dateneingabe!B109)","v":""},{"$f":"IF(Dateneingabe!E109=\"\",\"\",Dateneingabe!E109)","v":""},{"$f":"IF(Dateneingabe!F109=\"\",\"\",Dateneingabe!F109)","v":""},{"$f":"IF(Dateneingabe!G109=\"\",\"\",Dateneingabe!G109)","v":""},{"$f":"IF(Dateneingabe!H109=\"\",\"\",Dateneingabe!H109)","v":""},{"$f":"IF(Dateneingabe!I109=\"\",\"\",Dateneingabe!I109)","v":""},null,null,null,null,null,null,null,null,null,null,null,0,""]
[{"$f":"'Hinweise - bitte beachten!!!'!A1:A1&\" - \"&'Hinweise - bitte beachten!!!'!A2:A2","v":"HSVRM Obedience Auswertung - Version 2019 v5.1 - erstellt von Sören Marquardt für den Hundesportverband Rhein-Main (HSVRM)"}]
[null,null,null,null,null,null,null,{"$f":"IF(H8=\"\",0,H8)","v":0},{"$f":"IF(I8=\"\",0,I8)","v":0},0,0,0,0,0,0,0,0,0,{"$f":"SUM(H27*$H$6+I27*$I$6+J27*$J$6+K27*$K$6+L27*$L$6+M27*$M$6+N27*$N$6+O27*$O$6+P27*$P$6+Q27*$Q$6+R27*$R$6)","v":0}]
[{"$f":"'Übersicht Übungen'!H35","v":256},{"$f":"'Übersicht Übungen'!I35","v":320},"Punkte","Punkte",null,null,null,{"$f":"IF(H9=\"\",0,H9)","v":0},0,0,0,0,0,0,0,0,0,0,0]
[{"$f":"'Übersicht Übungen'!H36","v":224},{"$f":"'Übersicht Übungen'!I36","v":255.5},0,0,null,null,null,0,0,0,0,0,0,0,0,0,0,0,0]
[{"$f":"'Übersicht Übungen'!H37","v":192},{"$f":"'Übersicht Übungen'!I37","v":223.5},5,5,null,null,null,0,0,0,0,0,0,0,0,0,0,0,0]
[{"$f":"'Übersicht Übungen'!H38","v":0},{"$f":"'Übersicht Übungen'!I38","v":191.5},5.25,5.5,null,null,null,0,0,0,0,0,0,0,0,0,0,0,0]
[null,null,5.5,6,null,null,null,0,0,0,0,0,0,0,0,0,0,0,0]
[null,null,5.75,6.5,null,null,null,0,0,0,0,0,0,0,0,0,0,0,0]
[null,null,6,7,null,null,null,0,0,0,0,0,0,0,0,0,0,0,0]
[null,null,6.25,7.5,null,null,null,0,0,0,0,0,0,0,0,0,0,0,0]
[null,null,6.5,8,null,null,null,0,0,0,0,0,0,0,0,0,0,0,0]
[null,null,6.75,8.5,null,null,null,0,0,0,0,0,0,0,0,0,0,0,0]
[null,null,7,9,null,null,null,0,0,0,0,0,0,0,0,0,0,0,0]
[null,null,7.25,9.5,null,null,null,0,0,0,0,0,0,0,0,0,0,0,0]
[null,null,7.5,10,null,null,null,0,0,0,0,0,0,0,0,0,0,0,0]
[null,null,7.75,null,null,null,null,0,0,0,0,0,0,0,0,0,0,0,0]
[null,null,8,null,null,null,null,0,0,0,0,0,0,0,0,0,0,0,0]
[null,null,8.25,null,null,null,null,0,0,0,0,0,0,0,0,0,0,0,0]
[null,null,8.5,null,null,null,null,{"$f":"IF(H25=\"\",0,H25)","v":0},0,0,0,0,0,0,0,0,0,0,0]
[null,null,8.75]
[null,null,9]
[null,null,9.25]
[null,null,9.5]
[null,null,9.75]
[null,null,10]

{"sheet":"Übersicht Übungen","index":10,"n_rows":71,"n_cols":11,"rows_kept":71,"cut":false,"hidden":false,"merged":[[32,6,32,8],[45,6,45,8],[45,2,45,4],[59,0,59,1],[59,2,59,4],[59,6,59,8],[60,6,60,8],[46,6,46,8],[3,0,3,1],[0,0,0,8],[1,0,1,8],[17,0,17,1],[31,0,31,1],[17,6,17,8],[18,6,18,8],[3,2,3,4],[17,2,17,4],[3,6,3,8],[4,6,4,8],[31,2,31,4],[31,6,31,8],[45,0,45,1]]}
["Übersicht der Übungen und Festlegung der Reihenfolge der Einzel-Vorführungen",null,null,null,null,null,null,null,null,null,{"$f":"IF(SUM(SUM('Liste Beginner'!H8:R25)+SUM('Liste Klasse 1'!H8:R25)+SUM('Liste Klasse 2'!H8:R25)+SUM('Liste Klasse 3'!H8:R25)+SUM('Liste Klasse S'!H8:R25))=0,\"Sortieren OK\",\"KEIN Sortieren!\")","v":"Sortieren OK"}]
[{"$f":"'Hinweise - bitte beachten!!!'!A1:A1&\" - \"&'Hinweise - bitte beachten!!!'!A2:A2","v":"HSVRM Obedience Auswertung - Version 2019 v5.1 - erstellt von Sören Marquardt für den Hundesportverband Rhein-Main (HSVRM)"}]
[]
["Übung",null,"Beginner-Klasse",null,null,null,"Wertnotenschlüssel"]
["Nummer","Reihenfolge","Koeffizient","Art","Bezeichnung",null,"Beginner"]
[1,1,4,"Gruppe","Verhalten gegenüber anderen Hunden",null,"WN","von","bis"]
[2,2,3,"Gruppe","Stehen und Betasten",null,"V",256,320]
[3,3,3,"Gruppe","2 Minuten Liegen mit Sichtkontakt",null,"SG",224,255.5]
[4,4,3,"Einzel","Freifolge",null,"G",192,223.5]
[5,5,2,"Einzel","Sitz oder Platz aus der Bewegung",null,"oAK",0,191.5]
[6,6,3,"Einzel","Voraussenden in ein Quadrat mit Platz"]
[7,7,3,"Einzel","Abrufen"]
[8,8,3,"Einzel","Apport auf ebener Erde"]
[9,9,3,"Einzel","Kontrolle auf Distanz"]
[10,10,3,"Einzel","Um einen Pylon schicken"]
[11,11,2,"Einzel","Gesamteindruck"]
[]
["Übung",null,"Klasse 1",null,null,null,"Wertnotenschlüssel"]
["Nummer","Reihenfolge","Koeffizient","Art","Bezeichnung",null,"Klasse 1"]
[1,1,3,"Gruppe","1 Minute Sitzen in einer Gruppe, Hundeführer in Sicht",null,"WN","von","bis"]
[2,2,3,"Einzel","Freifolge",null,"V",256,320]
[3,3,3,"Einzel","Steh aus der Bewegung",null,"SG",224,255.5]
[4,4,3,"Einzel","Abrufen",null,"G",192,223.5]
[5,5,2,"Einzel","Sitz oder Platz aus der Bewegung",null,"oAK",0,191.5]
[6,6,3,"Einzel","In ein Quadrat schicken mit Platz"]
[7,7,4,"Einzel","Holzapport"]
[8,8,3,"Einzel","Distanzkontrolle"]
[9,9,3,"Einzel","Abrufen über eine Hürde"]
[10,10,3,"Einzel","Um einen Pylon schicken"]
[11,11,2,"Einzel","Gesamteindruck"]
[]
["Übung",null,"Klasse 2",null,null,null,"Wertnotenschlüssel"]
["Nummer","Reihenfolge","Koeffizient","Art","Bezeichnung",null,"Klasse 2"]
[1,1,2,"Gruppe","2 Minuten Liegen in einer Gruppe, Hundeführer außer Sicht",null,"WN","von","bis"]
[2,2,3,"Einzel","Freifolge",null,"V",256,320]
[3,3,3,"Einzel","Steh und/oder Sitz und/oder Platz aus der Bewegung",null,"SG",224,255.5]
[4,4,4,"Einzel","Abrufen mit Steh",null,"G",192,223.5]
[5,5,4,"Einzel","In ein Quadrat schicken mit Platz und Abrufen",null,"oAK",0,191.5]
[6,6,3,"Einzel","Apportieren mit Richtungsanweisung"]
[7,7,4,"Einzel","Identifizieren (6 Holzgegenstände)"]
[8,8,4,"Einzel","Distanzkontrolle"]
[9,9,3,"Einzel","Apport eines Metallgegenstandes über eine Hürde"]
[10,10,2,"Einzel","Gesamteindruck"]
[]
[]
["Übung",null,"FCI Klasse 3",null,null,null,"Wertnotenschlüssel"]
["Nummer","Reihenfolge","Koeffizient","Art","Bezeichnung",null,"FCI Klasse 3"]
[1,1,2,"Gruppe","2 Minuten Sitzen in der Gruppe außer Sicht",null,"WN","von","bis"]
[2,2,2,"Gruppe","1 Minute Liegen in der Gruppe mit Abrufen",null,"V",256,320]
[3,3,3,"Einzel","Freifolge",null,"SG",224,255.5]
[4,4,3,"Einzel","Steh, Sitz und Platz aus der Bewegung",null,"G",192,223.5]
[5,5,4,"Einzel","Abrufen mit Steh und Platz",null,"oAK",0,191.5]
[6,6,4,"Einzel","Voranschicken mit Richtungsanweisung, Ablegen und Abrufen"]
[7,7,3,"Einzel","Holzapport mit Richtungsanweisung"]
[8,8,4,"Einzel","Um Pylon schicken, Steh/Sitz/Platz und Holzapport mit RA über Hürde"]
[9,9,3,"Einzel","Identifizieren (6 bis 8 Holzgegenstände)"]
[10,10,4,"Einzel","Distanzkontrolle"]
[]
[]
["Übung",null,"Klasse S",null,null,null,"Wertnotenschlüssel"]
["Nummer","Reihenfolge","Koeffizient","Art","Bezeichnung",null,"Klasse S"]
[1,1,4,"Gruppe","2 Minuten Liegen in einer Gruppe, Hundeführer außer Sicht",null,"WN","von","bis"]
[2,2,3,"Einzel","Freifolge",null,"V",256,320]
[3,3,3,"Einzel","Abrufen",null,"SG",224,255.5]
[4,4,3,"Einzel","In ein 15 Meter entferntes Quadrat schicken mit Platz",null,"G",192,223.5]
[5,5,4,"Einzel","Steh und/oder Sitz und/oder Platz aus der Bewegung",null,"oAK",0,191.5]
[6,6,3,"Einzel","Apportieren mit Richtungsanweisung"]
[7,7,2,"Einzel","Um einen 5 Meter entfernten Pylon herumschicken "]
[8,8,4,"Einzel","Geruchsidentifizierung aus 6 Holzgegenständen"]
[9,9,4,"Einzel","Distanzkontrolle aus 10 Meter"]
[10,10,2,"Einzel","Gesamteindruck"]

{"sheet":"Chip-Kontrolle","index":11,"n_rows":98,"n_cols":18,"rows_kept":98,"cut":false,"hidden":false,"merged":[[5,7,5,8],[6,7,6,8],[7,7,7,8],[8,7,8,8],[9,7,9,8],[10,7,10,8],[11,7,11,8],[12,7,12,8],[13,7,13,8],[96,9,96,16],[96,17,96,19],[97,9,97,16],[97,17,97,19],[94,9,94,16],[94,17,94,19],[95,9,95,16],[95,17,95,19],[94,7,94,8],[95,7,95,8],[96,7,96,8],[97,7,97,8],[92,9,92,16],[92,17,92,19],[93,9,93,16],[93,17,93,19],[90,9,90,16],[90,17,90,19],[91,9,91,16],[91,17,91,19],[90,7,90,8],[91,7,91,8],[92,7,92,8],[93,7,93,8],[88,9,88,16],[88,17,88,19],[89,9,89,16],[89,17,89,19],[86,9,86,16],[86,17,86,19],[87,9,87,16],[87,17,87,19],[86,7,86,8],[87,7,87,8],[88,7,88,8],[89,7,89,8],[84,9,84,16],[84,17,84,19],[85,9,85,16],[85,17,85,19],[82,9,82,16],[82,17,82,19],[83,9,83,16],[83,17,83,19],[82,7,82,8],[83,7,83,8],[84,7,84,8],[85,7,85,8],[80,9,80,16],[80,17,80,19],[81,9,81,16],[81,17,81,19],[78,9,78,16],[78,17,78,19],[79,9,79,16],[79,17,79,19],[78,7,78,8],[79,7,79,8],[80,7,80,8],[81,7,81,8],[76,9,76,16],[76,17,76,19],[77,9,77,16],[77,17,77,19],[74,9,74,16],[74,17,74,19],[75,9,75,16],[75,17,75,19],[74,7,74,8],[75,7,75,8],[76,7,76,8],[77,7,77,8],[72,9,72,16],[72,17,72,19],[73,9,73,16],[73,17,73,19],[70,9,70,16],[70,17,70,19],[71,9,71,16],[71,17,71,19],[70,7,70,8],[71,7,71,8],[72,7,72,8],[73,7,73,8],[68,9,68,16],[68,17,68,19],[69,9,69,16],[69,17,69,19],[66,9,66,16],[66,17,66,19],[67,9,67,16],[67,17,67,19],[66,7,66,8],[67,7,67,8],[68,7,68,8],[69,7,69,8],[64,9,64,16],[64,17,64,19],[65,9,65,16],[65,17,65,19],[62,9,62,16],[62,17,62,19],[63,9,63,16],[63,17,63,19],[62,7,62,8],[63,7,63,8],[64,7,64,8],[65,7,65,8],[60,9,60,16],[60,17,60,19],[61,9,61,16],[61,17,61,19],[58,9,58,16],[58,17,58,19],[59,9,59,16],[59,17,59,19],[58,7,58,8],[59,7,59,8],[60,7,60,8],[61,7,61,8],[56,9,56,16],[56,17,56,19],[57,9,57,16],[57,17,57,19],[54,9,54,16],[54,17,54,19],[55,9,55,16],[55,17,55,19],[54,7,54,8],[55,7,55,8],[56,7,56,8],[57,7,57,8],[52,9,52,16],[52,17,52,19],[53,9,53,16],[53,17,53,19],[50,9,50,16],[50,17,50,19],[51,9,51,16],[51,17,51,19],[50,7,50,8],[51,7,51,8],[52,7,52,8],[53,7,53,8],[48,9,48,16],[48,17,48,19],[49,9,49,16],[49,17,49,19],[46,9,46,16],[46,17,46,19],[47,9,47,16],[47,17,47,19],[46,7,46,8],[47,7,47,8],[48,7,48,8],[49,7,49,8],[44,9,44,16],[44,17,44,19],[45,9,45,16],[45,17,45,19],[42,9,42,16],[42,17,42,19],[43,9,43,16],[43,17,43,19],[42,7,42,8],[43,7,43,8],[44,7,44,8],[45,7,45,8],[40,9,40,16],[40,17,40,19],[41,9,41,16],[41,17,41,19],[38,9,38,16],[38,17,38,19],[39,9,39,16],[39,17,39,19],[38,7,38,8],[39,7,39,8],[40,7,40,8],[41,7,41,8],[36,9,36,16],[36,17,36,19],[37,9,37,16],[37,17,37,19],[34,9,34,16],[34,17,34,19],[35,9,35,16],[35,17,35,19],[34,7,34,8],[35,7,35,8],[36,7,36,8],[37,7,37,8],[32,9,32,16],[32,17,32,19],[33,9,33,16],[33,17,33,19],[30,9,30,16],[30,17,30,19],[31,9,31,16],[31,17,31,19],[30,7,30,8],[31,7,31,8],[32,7,32,8],[33,7,33,8],[29,9,29,16],[29,17,29,19],[26,9,26,16],[26,17,26,19],[27,9,27,16],[27,17,27,19],[26,7,26,8],[27,7,27,8],[28,7,28,8],[29,7,29,8],[24,17,24,19],[25,9,25,16],[25,17,25,19],[21,9,21,16],[22,9,22,16],[22,17,22,19],[23,9,23,16],[23,17,23,19],[28,9,28,16],[28,17,28,19],[23,7,23,8],[24,7,24,8],[25,7,25,8],[10,9,10,16],[8,9,8,16],[18,9,18,16],[19,9,19,16],[20,9,20,16],[13,9,13,16],[14,9,14,16],[15,9,15,16],[24,9,24,16],[14,7,14,8],[15,7,15,8],[16,7,16,8],[17,7,17,8],[18,7,18,8],[19,7,19,8],[20,7,20,8],[21,7,21,8],[22,7,22,8],[18,17,18,19],[19,17,19,19],[20,17,20,19],[21,17,21,19],[10,17,10,19],[11,17,11,19],[12,17,12,19],[13,17,13,19],[14,17,14,19],[15,17,15,19],[5,17,5,19],[6,17,6,19],[7,17,7,19],[8,17,8,19],[9,17,9,19],[16,9,16,16],[17,9,17,16],[11,9,11,16],[12,9,12,16],[16,17,16,19],[17,17,17,19],[5,9,5,16],[6,9,6,16],[7,9,7,16],[9,9,9,16],[0,0,0,12],[0,13,0,19],[1,0,1,4],[1,5,1,15],[1,17,1,19],[3,17,3,19],[3,9,3,16],[4,17,4,19],[4,9,4,16],[3,7,3,8],[4,7,4,8]]}
[{"$f":"\"HSVRM Obedience: \"&Dateneingabe!C6&\"\"","v":"HSVRM Obedience: <Titel der Veranstaltung - z. B. Obedience-Prüfung>"},null,null,null,null,null,null,null,null,null,null,null,null,"Chip-Kontrolle"]
[{"$f":"\"Veranstalter: \"&Dateneingabe!C5","v":"Veranstalter: <Veranstaltender Verein oder Verband>"},null,null,null,null,{"$f":"\"LR: \"&Dateneingabe!I4","v":"LR: <Name der Leistungsrichter>"},null,null,null,null,null,null,null,null,null,null,"am:",{"$f":"Dateneingabe!C7","v":"<Prüfungstag/e>"}]
[{"$f":"'Hinweise - bitte beachten!!!'!A1:A1&\" - \"&'Hinweise - bitte beachten!!!'!A2:A2","v":"HSVRM Obedience Auswertung - Version 2019 v5.1 - erstellt von Sören Marquardt für den Hundesportverband Rhein-Main (HSVRM)"}]
["Klasse Beginner\nStart / Los / Klasse","Hundeführer/-in","Verein","Verband","Hund","Rasse","SH","Tätowierung",null,"Chipnummer",null,null,null,null,null,null,null,"Geprüft"]
[{"$f":"IF('Liste Beginner'!A8=\"\",\"\",'Liste Beginner'!A8&\" / \"&'Liste Beginner'!B8&\" / Beginner\")","v":""},{"$f":"IF('Liste Beginner'!C8=\"\",\"\",'Liste Beginner'!C8)","v":""},{"$f":"IF('Liste Beginner'!D8=\"\",\"\",'Liste Beginner'!D8)","v":""},{"$f":"IF('Liste Beginner'!E8=\"\",\"\",'Liste Beginner'!E8)","v":""},{"$f":"IF('Liste Beginner'!F8=\"\",\"\",'Liste Beginner'!F8)","v":""},{"$f":"IF('Liste Beginner'!G8=\"\",\"\",'Liste Beginner'!G8)","v":""},{"$f":"IF($A5=\"\",\"\",VLOOKUP($A5,Dateneingabe!$D$11:$P$109,8,FALSE))","v":""},{"$f":"IF($A5=\"\",\"\",VLOOKUP($A5,Dateneingabe!$D$11:$P$109,11,FALSE))","v":""},null,{"$f":"IF($A5=\"\",\"\",VLOOKUP($A5,Dateneingabe!$D$11:$P$109,12,FALSE))","v":""}]
[{"$f":"IF('Liste Beginner'!A9=\"\",\"\",'Liste Beginner'!A9&\" / \"&'Liste Beginner'!B9&\" / Beginner\")","v":""},{"$f":"IF('Liste Beginner'!C9=\"\",\"\",'Liste Beginner'!C9)","v":""},{"$f":"IF('Liste Beginner'!D9=\"\",\"\",'Liste Beginner'!D9)","v":""},{"$f":"IF('Liste Beginner'!E9=\"\",\"\",'Liste Beginner'!E9)","v":""},{"$f":"IF('Liste Beginner'!F9=\"\",\"\",'Liste Beginner'!F9)","v":""},{"$f":"IF('Liste Beginner'!G9=\"\",\"\",'Liste Beginner'!G9)","v":""},{"$f":"IF($A6=\"\",\"\",VLOOKUP($A6,Dateneingabe!$D$11:$P$109,8,FALSE))","v":""},{"$f":"IF($A6=\"\",\"\",VLOOKUP($A6,Dateneingabe!$D$11:$P$29,11,FALSE))","v":""},null,{"$f":"IF($A6=\"\",\"\",VLOOKUP($A6,Dateneingabe!$D$11:$P$29,12,FALSE))","v":""}]
[{"$f":"IF('Liste Beginner'!A10=\"\",\"\",'Liste Beginner'!A10&\" / \"&'Liste Beginner'!B10&\" / Beginner\")","v":""},{"$f":"IF('Liste Beginner'!C10=\"\",\"\",'Liste Beginner'!C10)","v":""},{"$f":"IF('Liste Beginner'!D10=\"\",\"\",'Liste Beginner'!D10)","v":""},{"$f":"IF('Liste Beginner'!E10=\"\",\"\",'Liste Beginner'!E10)","v":""},{"$f":"IF('Liste Beginner'!F10=\"\",\"\",'Liste Beginner'!F10)","v":""},{"$f":"IF('Liste Beginner'!G10=\"\",\"\",'Liste Beginner'!G10)","v":""},{"$f":"IF($A7=\"\",\"\",VLOOKUP($A7,Dateneingabe!$D$11:$P$109,8,FALSE))","v":""},{"$f":"IF($A7=\"\",\"\",VLOOKUP($A7,Dateneingabe!$D$11:$P$29,11,FALSE))","v":""},null,{"$f":"IF($A7=\"\",\"\",VLOOKUP($A7,Dateneingabe!$D$11:$P$29,12,FALSE))","v":""}]
[{"$f":"IF('Liste Beginner'!A11=\"\",\"\",'Liste Beginner'!A11&\" / \"&'Liste Beginner'!B11&\" / Beginner\")","v":""},{"$f":"IF('Liste Beginner'!C11=\"\",\"\",'Liste Beginner'!C11)","v":""},{"$f":"IF('Liste Beginner'!D11=\"\",\"\",'Liste Beginner'!D11)","v":""},{"$f":"IF('Liste Beginner'!E11=\"\",\"\",'Liste Beginner'!E11)","v":""},{"$f":"IF('Liste Beginner'!F11=\"\",\"\",'Liste Beginner'!F11)","v":""},{"$f":"IF('Liste Beginner'!G11=\"\",\"\",'Liste Beginner'!G11)","v":""},{"$f":"IF($A8=\"\",\"\",VLOOKUP($A8,Dateneingabe!$D$11:$P$109,8,FALSE))","v":""},{"$f":"IF($A8=\"\",\"\",VLOOKUP($A8,Dateneingabe!$D$11:$P$29,11,FALSE))","v":""},null,{"$f":"IF($A8=\"\",\"\",VLOOKUP($A8,Dateneingabe!$D$11:$P$29,12,FALSE))","v":""}]
[{"$f":"IF('Liste Beginner'!A12=\"\",\"\",'Liste Beginner'!A12&\" / \"&'Liste Beginner'!B12&\" / Beginner\")","v":""},{"$f":"IF('Liste Beginner'!C12=\"\",\"\",'Liste Beginner'!C12)","v":""},{"$f":"IF('Liste Beginner'!D12=\"\",\"\",'Liste Beginner'!D12)","v":""},{"$f":"IF('Liste Beginner'!E12=\"\",\"\",'Liste Beginner'!E12)","v":""},{"$f":"IF('Liste Beginner'!F12=\"\",\"\",'Liste Beginner'!F12)","v":""},{"$f":"IF('Liste Beginner'!G12=\"\",\"\",'Liste Beginner'!G12)","v":""},{"$f":"IF($A9=\"\",\"\",VLOOKUP($A9,Dateneingabe!$D$11:$P$109,8,FALSE))","v":""},{"$f":"IF($A9=\"\",\"\",VLOOKUP($A9,Dateneingabe!$D$11:$P$29,11,FALSE))","v":""},null,{"$f":"IF($A9=\"\",\"\",VLOOKUP($A9,Dateneingabe!$D$11:$P$29,12,FALSE))","v":""}]
[{"$f":"IF('Liste Beginner'!A13=\"\",\"\",'Liste Beginner'!A13&\" / \"&'Liste Beginner'!B13&\" / Beginner\")","v":""},{"$f":"IF('Liste Beginner'!C13=\"\",\"\",'Liste Beginner'!C13)","v":""},{"$f":"IF('Liste Beginner'!D13=\"\",\"\",'Liste Beginner'!D13)","v":""},{"$f":"IF('Liste Beginner'!E13=\"\",\"\",'Liste Beginner'!E13)","v":""},{"$f":"IF('Liste Beginner'!F13=\"\",\"\",'Liste Beginner'!F13)","v":""},{"$f":"IF('Liste Beginner'!G13=\"\",\"\",'Liste Beginner'!G13)","v":""},{"$f":"IF($A10=\"\",\"\",VLOOKUP($A10,Dateneingabe!$D$11:$P$109,8,FALSE))","v":""},{"$f":"IF($A10=\"\",\"\",VLOOKUP($A10,Dateneingabe!$D$11:$P$29,11,FALSE))","v":""},null,{"$f":"IF($A10=\"\",\"\",VLOOKUP($A10,Dateneingabe!$D$11:$P$29,12,FALSE))","v":""}]
[{"$f":"IF('Liste Beginner'!A14=\"\",\"\",'Liste Beginner'!A14&\" / \"&'Liste Beginner'!B14&\" / Beginner\")","v":""},{"$f":"IF('Liste Beginner'!C14=\"\",\"\",'Liste Beginner'!C14)","v":""},{"$f":"IF('Liste Beginner'!D14=\"\",\"\",'Liste Beginner'!D14)","v":""},{"$f":"IF('Liste Beginner'!E14=\"\",\"\",'Liste Beginner'!E14)","v":""},{"$f":"IF('Liste Beginner'!F14=\"\",\"\",'Liste Beginner'!F14)","v":""},{"$f":"IF('Liste Beginner'!G14=\"\",\"\",'Liste Beginner'!G14)","v":""},{"$f":"IF($A11=\"\",\"\",VLOOKUP($A11,Dateneingabe!$D$11:$P$109,8,FALSE))","v":""},{"$f":"IF($A11=\"\",\"\",VLOOKUP($A11,Dateneingabe!$D$11:$P$29,11,FALSE))","v":""},null,{"$f":"IF($A11=\"\",\"\",VLOOKUP($A11,Dateneingabe!$D$11:$P$29,12,FALSE))","v":""}]
[{"$f":"IF('Liste Beginner'!A15=\"\",\"\",'Liste Beginner'!A15&\" / \"&'Liste Beginner'!B15&\" / Beginner\")","v":""},{"$f":"IF('Liste Beginner'!C15=\"\",\"\",'Liste Beginner'!C15)","v":""},{"$f":"IF('Liste Beginner'!D15=\"\",\"\",'Liste Beginner'!D15)","v":""},{"$f":"IF('Liste Beginner'!E15=\"\",\"\",'Liste Beginner'!E15)","v":""},{"$f":"IF('Liste Beginner'!F15=\"\",\"\",'Liste Beginner'!F15)","v":""},{"$f":"IF('Liste Beginner'!G15=\"\",\"\",'Liste Beginner'!G15)","v":""},{"$f":"IF($A12=\"\",\"\",VLOOKUP($A12,Dateneingabe!$D$11:$P$109,8,FALSE))","v":""},{"$f":"IF($A12=\"\",\"\",VLOOKUP($A12,Dateneingabe!$D$11:$P$29,11,FALSE))","v":""},null,{"$f":"IF($A12=\"\",\"\",VLOOKUP($A12,Dateneingabe!$D$11:$P$29,12,FALSE))","v":""}]
[{"$f":"IF('Liste Beginner'!A16=\"\",\"\",'Liste Beginner'!A16&\" / \"&'Liste Beginner'!B16&\" / Beginner\")","v":""},{"$f":"IF('Liste Beginner'!C16=\"\",\"\",'Liste Beginner'!C16)","v":""},{"$f":"IF('Liste Beginner'!D16=\"\",\"\",'Liste Beginner'!D16)","v":""},{"$f":"IF('Liste Beginner'!E16=\"\",\"\",'Liste Beginner'!E16)","v":""},{"$f":"IF('Liste Beginner'!F16=\"\",\"\",'Liste Beginner'!F16)","v":""},{"$f":"IF('Liste Beginner'!G16=\"\",\"\",'Liste Beginner'!G16)","v":""},{"$f":"IF($A13=\"\",\"\",VLOOKUP($A13,Dateneingabe!$D$11:$P$109,8,FALSE))","v":""},{"$f":"IF($A13=\"\",\"\",VLOOKUP($A13,Dateneingabe!$D$11:$P$29,11,FALSE))","v":""},null,{"$f":"IF($A13=\"\",\"\",VLOOKUP($A13,Dateneingabe!$D$11:$P$29,12,FALSE))","v":""}]
[{"$f":"IF('Liste Beginner'!A17=\"\",\"\",'Liste Beginner'!A17&\" / \"&'Liste Beginner'!B17&\" / Beginner\")","v":""},{"$f":"IF('Liste Beginner'!C17=\"\",\"\",'Liste Beginner'!C17)","v":""},{"$f":"IF('Liste Beginner'!D17=\"\",\"\",'Liste Beginner'!D17)","v":""},{"$f":"IF('Liste Beginner'!E17=\"\",\"\",'Liste Beginner'!E17)","v":""},{"$f":"IF('Liste Beginner'!F17=\"\",\"\",'Liste Beginner'!F17)","v":""},{"$f":"IF('Liste Beginner'!G17=\"\",\"\",'Liste Beginner'!G17)","v":""},{"$f":"IF($A14=\"\",\"\",VLOOKUP($A14,Dateneingabe!$D$11:$P$109,8,FALSE))","v":""},{"$f":"IF($A14=\"\",\"\",VLOOKUP($A14,Dateneingabe!$D$11:$P$29,11,FALSE))","v":""},null,{"$f":"IF($A14=\"\",\"\",VLOOKUP($A14,Dateneingabe!$D$11:$P$29,12,FALSE))","v":""}]
[{"$f":"IF('Liste Beginner'!A18=\"\",\"\",'Liste Beginner'!A18&\" / \"&'Liste Beginner'!B18&\" / Beginner\")","v":""},{"$f":"IF('Liste Beginner'!C18=\"\",\"\",'Liste Beginner'!C18)","v":""},{"$f":"IF('Liste Beginner'!D18=\"\",\"\",'Liste Beginner'!D18)","v":""},{"$f":"IF('Liste Beginner'!E18=\"\",\"\",'Liste Beginner'!E18)","v":""},{"$f":"IF('Liste Beginner'!F18=\"\",\"\",'Liste Beginner'!F18)","v":""},{"$f":"IF('Liste Beginner'!G18=\"\",\"\",'Liste Beginner'!G18)","v":""},{"$f":"IF($A15=\"\",\"\",VLOOKUP($A15,Dateneingabe!$D$11:$P$109,8,FALSE))","v":""},{"$f":"IF($A15=\"\",\"\",VLOOKUP($A15,Dateneingabe!$D$11:$P$29,11,FALSE))","v":""},null,{"$f":"IF($A15=\"\",\"\",VLOOKUP($A15,Dateneingabe!$D$11:$P$29,12,FALSE))","v":""}]
[{"$f":"IF('Liste Beginner'!A19=\"\",\"\",'Liste Beginner'!A19&\" / \"&'Liste Beginner'!B19&\" / Beginner\")","v":""},{"$f":"IF('Liste Beginner'!C19=\"\",\"\",'Liste Beginner'!C19)","v":""},{"$f":"IF('Liste Beginner'!D19=\"\",\"\",'Liste Beginner'!D19)","v":""},{"$f":"IF('Liste Beginner'!E19=\"\",\"\",'Liste Beginner'!E19)","v":""},{"$f":"IF('Liste Beginner'!F19=\"\",\"\",'Liste Beginner'!F19)","v":""},{"$f":"IF('Liste Beginner'!G19=\"\",\"\",'Liste Beginner'!G19)","v":""},{"$f":"IF($A16=\"\",\"\",VLOOKUP($A16,Dateneingabe!$D$11:$P$109,8,FALSE))","v":""},{"$f":"IF($A16=\"\",\"\",VLOOKUP($A16,Dateneingabe!$D$11:$P$29,11,FALSE))","v":""},null,{"$f":"IF($A16=\"\",\"\",VLOOKUP($A16,Dateneingabe!$D$11:$P$29,12,FALSE))","v":""}]
[{"$f":"IF('Liste Beginner'!A20=\"\",\"\",'Liste Beginner'!A20&\" / \"&'Liste Beginner'!B20&\" / Beginner\")","v":""},{"$f":"IF('Liste Beginner'!C20=\"\",\"\",'Liste Beginner'!C20)","v":""},{"$f":"IF('Liste Beginner'!D20=\"\",\"\",'Liste Beginner'!D20)","v":""},{"$f":"IF('Liste Beginner'!E20=\"\",\"\",'Liste Beginner'!E20)","v":""},{"$f":"IF('Liste Beginner'!F20=\"\",\"\",'Liste Beginner'!F20)","v":""},{"$f":"IF('Liste Beginner'!G20=\"\",\"\",'Liste Beginner'!G20)","v":""},{"$f":"IF($A17=\"\",\"\",VLOOKUP($A17,Dateneingabe!$D$11:$P$109,8,FALSE))","v":""},{"$f":"IF($A17=\"\",\"\",VLOOKUP($A17,Dateneingabe!$D$11:$P$29,11,FALSE))","v":""},null,{"$f":"IF($A17=\"\",\"\",VLOOKUP($A17,Dateneingabe!$D$11:$P$29,12,FALSE))","v":""}]
[{"$f":"IF('Liste Beginner'!A21=\"\",\"\",'Liste Beginner'!A21&\" / \"&'Liste Beginner'!B21&\" / Beginner\")","v":""},{"$f":"IF('Liste Beginner'!C21=\"\",\"\",'Liste Beginner'!C21)","v":""},{"$f":"IF('Liste Beginner'!D21=\"\",\"\",'Liste Beginner'!D21)","v":""},{"$f":"IF('Liste Beginner'!E21=\"\",\"\",'Liste Beginner'!E21)","v":""},{"$f":"IF('Liste Beginner'!F21=\"\",\"\",'Liste Beginner'!F21)","v":""},{"$f":"IF('Liste Beginner'!G21=\"\",\"\",'Liste Beginner'!G21)","v":""},{"$f":"IF($A18=\"\",\"\",VLOOKUP($A18,Dateneingabe!$D$11:$P$109,8,FALSE))","v":""},{"$f":"IF($A18=\"\",\"\",VLOOKUP($A18,Dateneingabe!$D$11:$P$29,11,FALSE))","v":""},null,{"$f":"IF($A18=\"\",\"\",VLOOKUP($A18,Dateneingabe!$D$11:$P$29,12,FALSE))","v":""}]
[{"$f":"IF('Liste Beginner'!A22=\"\",\"\",'Liste Beginner'!A22&\" / \"&'Liste Beginner'!B22&\" / Beginner\")","v":""},{"$f":"IF('Liste Beginner'!C22=\"\",\"\",'Liste Beginner'!C22)","v":""},{"$f":"IF('Liste Beginner'!D22=\"\",\"\",'Liste Beginner'!D22)","v":""},{"$f":"IF('Liste Beginner'!E22=\"\",\"\",'Liste Beginner'!E22)","v":""},{"$f":"IF('Liste Beginner'!F22=\"\",\"\",'Liste Beginner'!F22)","v":""},{"$f":"IF('Liste Beginner'!G22=\"\",\"\",'Liste Beginner'!G22)","v":""},{"$f":"IF($A19=\"\",\"\",VLOOKUP($A19,Dateneingabe!$D$11:$P$109,8,FALSE))","v":""},{"$f":"IF($A19=\"\",\"\",VLOOKUP($A19,Dateneingabe!$D$11:$P$29,11,FALSE))","v":""},null,{"$f":"IF($A19=\"\",\"\",VLOOKUP($A19,Dateneingabe!$D$11:$P$29,12,FALSE))","v":""}]
[{"$f":"IF('Liste Beginner'!A23=\"\",\"\",'Liste Beginner'!A23&\" / \"&'Liste Beginner'!B23&\" / Beginner\")","v":""},{"$f":"IF('Liste Beginner'!C23=\"\",\"\",'Liste Beginner'!C23)","v":""},{"$f":"IF('Liste Beginner'!D23=\"\",\"\",'Liste Beginner'!D23)","v":""},{"$f":"IF('Liste Beginner'!E23=\"\",\"\",'Liste Beginner'!E23)","v":""},{"$f":"IF('Liste Beginner'!F23=\"\",\"\",'Liste Beginner'!F23)","v":""},{"$f":"IF('Liste Beginner'!G23=\"\",\"\",'Liste Beginner'!G23)","v":""},{"$f":"IF($A20=\"\",\"\",VLOOKUP($A20,Dateneingabe!$D$11:$P$109,8,FALSE))","v":""},{"$f":"IF($A20=\"\",\"\",VLOOKUP($A20,Dateneingabe!$D$11:$P$29,11,FALSE))","v":""},null,{"$f":"IF($A20=\"\",\"\",VLOOKUP($A20,Dateneingabe!$D$11:$P$29,12,FALSE))","v":""}]
[{"$f":"IF('Liste Beginner'!A24=\"\",\"\",'Liste Beginner'!A24&\" / \"&'Liste Beginner'!B24&\" / Beginner\")","v":""},{"$f":"IF('Liste Beginner'!C24=\"\",\"\",'Liste Beginner'!C24)","v":""},{"$f":"IF('Liste Beginner'!D24=\"\",\"\",'Liste Beginner'!D24)","v":""},{"$f":"IF('Liste Beginner'!E24=\"\",\"\",'Liste Beginner'!E24)","v":""},{"$f":"IF('Liste Beginner'!F24=\"\",\"\",'Liste Beginner'!F24)","v":""},{"$f":"IF('Liste Beginner'!G24=\"\",\"\",'Liste Beginner'!G24)","v":""},{"$f":"IF($A21=\"\",\"\",VLOOKUP($A21,Dateneingabe!$D$11:$P$109,8,FALSE))","v":""},{"$f":"IF($A21=\"\",\"\",VLOOKUP($A21,Dateneingabe!$D$11:$P$29,11,FALSE))","v":""},null,{"$f":"IF($A21=\"\",\"\",VLOOKUP($A21,Dateneingabe!$D$11:$P$29,12,FALSE))","v":""}]
[{"$f":"IF('Liste Beginner'!A25=\"\",\"\",'Liste Beginner'!A25&\" / \"&'Liste Beginner'!B25&\" / Beginner\")","v":""},{"$f":"IF('Liste Beginner'!C25=\"\",\"\",'Liste Beginner'!C25)","v":""},{"$f":"IF('Liste Beginner'!D25=\"\",\"\",'Liste Beginner'!D25)","v":""},{"$f":"IF('Liste Beginner'!E25=\"\",\"\",'Liste Beginner'!E25)","v":""},{"$f":"IF('Liste Beginner'!F25=\"\",\"\",'Liste Beginner'!F25)","v":""},{"$f":"IF('Liste Beginner'!G25=\"\",\"\",'Liste Beginner'!G25)","v":""},{"$f":"IF($A22=\"\",\"\",VLOOKUP($A22,Dateneingabe!$D$11:$P$109,8,FALSE))","v":""},{"$f":"IF($A22=\"\",\"\",VLOOKUP($A22,Dateneingabe!$D$11:$P$29,11,FALSE))","v":""},null,{"$f":"IF($A22=\"\",\"\",VLOOKUP($A22,Dateneingabe!$D$11:$P$29,12,FALSE))","v":""}]
["Klasse 1\nStart / Los / Klasse","Hundeführer/-in","Verein","Verband","Hund","Rasse","SH","Tätowierung",null,"Chipnummer",null,null,null,null,null,null,null,"Geprüft"]
[{"$f":"IF('Liste Klasse 1'!A8=\"\",\"\",'Liste Klasse 1'!A8&\" / \"&'Liste Klasse 1'!B8&\" / Klasse 1\")","v":""},{"$f":"IF('Liste Klasse 1'!C8=\"\",\"\",'Liste Klasse 1'!C8)","v":""},{"$f":"IF('Liste Klasse 1'!D8=\"\",\"\",'Liste Klasse 1'!D8)","v":""},{"$f":"IF('Liste Klasse 1'!E8=\"\",\"\",'Liste Klasse 1'!E8)","v":""},{"$f":"IF('Liste Klasse 1'!F8=\"\",\"\",'Liste Klasse 1'!F8)","v":""},{"$f":"IF('Liste Klasse 1'!G8=\"\",\"\",'Liste Klasse 1'!G8)","v":""},{"$f":"IF($A24=\"\",\"\",VLOOKUP($A24,Dateneingabe!$D$11:$P$109,8,FALSE))","v":""},{"$f":"IF($A24=\"\",\"\",VLOOKUP($A24,Dateneingabe!$D$11:$P$109,11,FALSE))","v":""},null,{"$f":"IF($A24=\"\",\"\",VLOOKUP($A24,Dateneingabe!$D$11:$P$109,12,FALSE))","v":""}]
[{"$f":"IF('Liste Klasse 1'!A9=\"\",\"\",'Liste Klasse 1'!A9&\" / \"&'Liste Klasse 1'!B9&\" / Klasse 1\")","v":""},{"$f":"IF('Liste Klasse 1'!C9=\"\",\"\",'Liste Klasse 1'!C9)","v":""},{"$f":"IF('Liste Klasse 1'!D9=\"\",\"\",'Liste Klasse 1'!D9)","v":""},{"$f":"IF('Liste Klasse 1'!E9=\"\",\"\",'Liste Klasse 1'!E9)","v":""},{"$f":"IF('Liste Klasse 1'!F9=\"\",\"\",'Liste Klasse 1'!F9)","v":""},{"$f":"IF('Liste Klasse 1'!G9=\"\",\"\",'Liste Klasse 1'!G9)","v":""},{"$f":"IF($A25=\"\",\"\",VLOOKUP($A25,Dateneingabe!$D$11:$P$109,8,FALSE))","v":""},{"$f":"IF($A25=\"\",\"\",VLOOKUP($A25,Dateneingabe!$D$11:$P$109,11,FALSE))","v":""},null,{"$f":"IF($A25=\"\",\"\",VLOOKUP($A25,Dateneingabe!$D$11:$P$109,12,FALSE))","v":""}]
[{"$f":"IF('Liste Klasse 1'!A10=\"\",\"\",'Liste Klasse 1'!A10&\" / \"&'Liste Klasse 1'!B10&\" / Klasse 1\")","v":""},{"$f":"IF('Liste Klasse 1'!C10=\"\",\"\",'Liste Klasse 1'!C10)","v":""},{"$f":"IF('Liste Klasse 1'!D10=\"\",\"\",'Liste Klasse 1'!D10)","v":""},{"$f":"IF('Liste Klasse 1'!E10=\"\",\"\",'Liste Klasse 1'!E10)","v":""},{"$f":"IF('Liste Klasse 1'!F10=\"\",\"\",'Liste Klasse 1'!F10)","v":""},{"$f":"IF('Liste Klasse 1'!G10=\"\",\"\",'Liste Klasse 1'!G10)","v":""},{"$f":"IF($A26=\"\",\"\",VLOOKUP($A26,Dateneingabe!$D$11:$P$109,8,FALSE))","v":""},{"$f":"IF($A26=\"\",\"\",VLOOKUP($A26,Dateneingabe!$D$11:$P$109,11,FALSE))","v":""},null,{"$f":"IF($A26=\"\",\"\",VLOOKUP($A26,Dateneingabe!$D$11:$P$109,12,FALSE))","v":""}]
[{"$f":"IF('Liste Klasse 1'!A11=\"\",\"\",'Liste Klasse 1'!A11&\" / \"&'Liste Klasse 1'!B11&\" / Klasse 1\")","v":""},{"$f":"IF('Liste Klasse 1'!C11=\"\",\"\",'Liste Klasse 1'!C11)","v":""},{"$f":"IF('Liste Klasse 1'!D11=\"\",\"\",'Liste Klasse 1'!D11)","v":""},{"$f":"IF('Liste Klasse 1'!E11=\"\",\"\",'Liste Klasse 1'!E11)","v":""},{"$f":"IF('Liste Klasse 1'!F11=\"\",\"\",'Liste Klasse 1'!F11)","v":""},{"$f":"IF('Liste Klasse 1'!G11=\"\",\"\",'Liste Klasse 1'!G11)","v":""},{"$f":"IF($A27=\"\",\"\",VLOOKUP($A27,Dateneingabe!$D$11:$P$109,8,FALSE))","v":""},{"$f":"IF($A27=\"\",\"\",VLOOKUP($A27,Dateneingabe!$D$11:$P$109,11,FALSE))","v":""},null,{"$f":"IF($A27=\"\",\"\",VLOOKUP($A27,Dateneingabe!$D$11:$P$109,12,FALSE))","v":""}]
[{"$f":"IF('Liste Klasse 1'!A12=\"\",\"\",'Liste Klasse 1'!A12&\" / \"&'Liste Klasse 1'!B12&\" / Klasse 1\")","v":""},{"$f":"IF('Liste Klasse 1'!C12=\"\",\"\",'Liste Klasse 1'!C12)","v":""},{"$f":"IF('Liste Klasse 1'!D12=\"\",\"\",'Liste Klasse 1'!D12)","v":""},{"$f":"IF('Liste Klasse 1'!E12=\"\",\"\",'Liste Klasse 1'!E12)","v":""},{"$f":"IF('Liste Klasse 1'!F12=\"\",\"\",'Liste Klasse 1'!F12)","v":""},{"$f":"IF('Liste Klasse 1'!G12=\"\",\"\",'Liste Klasse 1'!G12)","v":""},{"$f":"IF($A28=\"\",\"\",VLOOKUP($A28,Dateneingabe!$D$11:$P$109,8,FALSE))","v":""},{"$f":"IF($A28=\"\",\"\",VLOOKUP($A28,Dateneingabe!$D$11:$P$109,11,FALSE))","v":""},null,{"$f":"IF($A28=\"\",\"\",VLOOKUP($A28,Dateneingabe!$D$11:$P$109,12,FALSE))","v":""}]
[{"$f":"IF('Liste Klasse 1'!A13=\"\",\"\",'Liste Klasse 1'!A13&\" / \"&'Liste Klasse 1'!B13&\" / Klasse 1\")","v":""},{"$f":"IF('Liste Klasse 1'!C13=\"\",\"\",'Liste Klasse 1'!C13)","v":""},{"$f":"IF('Liste Klasse 1'!D13=\"\",\"\",'Liste Klasse 1'!D13)","v":""},{"$f":"IF('Liste Klasse 1'!E13=\"\",\"\",'Liste Klasse 1'!E13)","v":""},{"$f":"IF('Liste Klasse 1'!F13=\"\",\"\",'Liste Klasse 1'!F13)","v":""},{"$f":"IF('Liste Klasse 1'!G13=\"\",\"\",'Liste Klasse 1'!G13)","v":""},{"$f":"IF($A29=\"\",\"\",VLOOKUP($A29,Dateneingabe!$D$11:$P$109,8,FALSE))","v":""},{"$f":"IF($A29=\"\",\"\",VLOOKUP($A29,Dateneingabe!$D$11:$P$109,11,FALSE))","v":""},null,{"$f":"IF($A29=\"\",\"\",VLOOKUP($A29,Dateneingabe!$D$11:$P$109,12,FALSE))","v":""}]
[{"$f":"IF('Liste Klasse 1'!A14=\"\",\"\",'Liste Klasse 1'!A14&\" / \"&'Liste Klasse 1'!B14&\" / Klasse 1\")","v":""},{"$f":"IF('Liste Klasse 1'!C14=\"\",\"\",'Liste Klasse 1'!C14)","v":""},{"$f":"IF('Liste Klasse 1'!D14=\"\",\"\",'Liste Klasse 1'!D14)","v":""},{"$f":"IF('Liste Klasse 1'!E14=\"\",\"\",'Liste Klasse 1'!E14)","v":""},{"$f":"IF('Liste Klasse 1'!F14=\"\",\"\",'Liste Klasse 1'!F14)","v":""},{"$f":"IF('Liste Klasse 1'!G14=\"\",\"\",'Liste Klasse 1'!G14)","v":""},{"$f":"IF($A30=\"\",\"\",VLOOKUP($A30,Dateneingabe!$D$11:$P$109,8,FALSE))","v":""},{"$f":"IF($A30=\"\",\"\",VLOOKUP($A30,Dateneingabe!$D$11:$P$109,11,FALSE))","v":""},null,{"$f":"IF($A30=\"\",\"\",VLOOKUP($A30,Dateneingabe!$D$11:$P$109,12,FALSE))","v":""}]
[{"$f":"IF('Liste Klasse 1'!A15=\"\",\"\",'Liste Klasse 1'!A15&\" / \"&'Liste Klasse 1'!B15&\" / Klasse 1\")","v":""},{"$f":"IF('Liste Klasse 1'!C15=\"\",\"\",'Liste Klasse 1'!C15)","v":""},{"$f":"IF('Liste Klasse 1'!D15=\"\",\"\",'Liste Klasse 1'!D15)","v":""},{"$f":"IF('Liste Klasse 1'!E15=\"\",\"\",'Liste Klasse 1'!E15)","v":""},{"$f":"IF('Liste Klasse 1'!F15=\"\",\"\",'Liste Klasse 1'!F15)","v":""},{"$f":"IF('Liste Klasse 1'!G15=\"\",\"\",'Liste Klasse 1'!G15)","v":""},{"$f":"IF($A31=\"\",\"\",VLOOKUP($A31,Dateneingabe!$D$11:$P$109,8,FALSE))","v":""},{"$f":"IF($A31=\"\",\"\",VLOOKUP($A31,Dateneingabe!$D$11:$P$109,11,FALSE))","v":""},null,{"$f":"IF($A31=\"\",\"\",VLOOKUP($A31,Dateneingabe!$D$11:$P$109,12,FALSE))","v":""}]
[{"$f":"IF('Liste Klasse 1'!A16=\"\",\"\",'Liste Klasse 1'!A16&\" / \"&'Liste Klasse 1'!B16&\" / Klasse 1\")","v":""},{"$f":"IF('Liste Klasse 1'!C16=\"\",\"\",'Liste Klasse 1'!C16)","v":""},{"$f":"IF('Liste Klasse 1'!D16=\"\",\"\",'Liste Klasse 1'!D16)","v":""},{"$f":"IF('Liste Klasse 1'!E16=\"\",\"\",'Liste Klasse 1'!E16)","v":""},{"$f":"IF('Liste Klasse 1'!F16=\"\",\"\",'Liste Klasse 1'!F16)","v":""},{"$f":"IF('Liste Klasse 1'!G16=\"\",\"\",'Liste Klasse 1'!G16)","v":""},{"$f":"IF($A32=\"\",\"\",VLOOKUP($A32,Dateneingabe!$D$11:$P$109,8,FALSE))","v":""},{"$f":"IF($A32=\"\",\"\",VLOOKUP($A32,Dateneingabe!$D$11:$P$109,11,FALSE))","v":""},null,{"$f":"IF($A32=\"\",\"\",VLOOKUP($A32,Dateneingabe!$D$11:$P$109,12,FALSE))","v":""}]
[{"$f":"IF('Liste Klasse 1'!A17=\"\",\"\",'Liste Klasse 1'!A17&\" / \"&'Liste Klasse 1'!B17&\" / Klasse 1\")","v":""},{"$f":"IF('Liste Klasse 1'!C17=\"\",\"\",'Liste Klasse 1'!C17)","v":""},{"$f":"IF('Liste Klasse 1'!D17=\"\",\"\",'Liste Klasse 1'!D17)","v":""},{"$f":"IF('Liste Klasse 1'!E17=\"\",\"\",'Liste Klasse 1'!E17)","v":""},{"$f":"IF('Liste Klasse 1'!F17=\"\",\"\",'Liste Klasse 1'!F17)","v":""},{"$f":"IF('Liste Klasse 1'!G17=\"\",\"\",'Liste Klasse 1'!G17)","v":""},{"$f":"IF($A33=\"\",\"\",VLOOKUP($A33,Dateneingabe!$D$11:$P$109,8,FALSE))","v":""},{"$f":"IF($A33=\"\",\"\",VLOOKUP($A33,Dateneingabe!$D$11:$P$109,11,FALSE))","v":""},null,{"$f":"IF($A33=\"\",\"\",VLOOKUP($A33,Dateneingabe!$D$11:$P$109,12,FALSE))","v":""}]
[{"$f":"IF('Liste Klasse 1'!A18=\"\",\"\",'Liste Klasse 1'!A18&\" / \"&'Liste Klasse 1'!B18&\" / Klasse 1\")","v":""},{"$f":"IF('Liste Klasse 1'!C18=\"\",\"\",'Liste Klasse 1'!C18)","v":""},{"$f":"IF('Liste Klasse 1'!D18=\"\",\"\",'Liste Klasse 1'!D18)","v":""},{"$f":"IF('Liste Klasse 1'!E18=\"\",\"\",'Liste Klasse 1'!E18)","v":""},{"$f":"IF('Liste Klasse 1'!F18=\"\",\"\",'Liste Klasse 1'!F18)","v":""},{"$f":"IF('Liste Klasse 1'!G18=\"\",\"\",'Liste Klasse 1'!G18)","v":""},{"$f":"IF($A34=\"\",\"\",VLOOKUP($A34,Dateneingabe!$D$11:$P$109,8,FALSE))","v":""},{"$f":"IF($A34=\"\",\"\",VLOOKUP($A34,Dateneingabe!$D$11:$P$109,11,FALSE))","v":""},null,{"$f":"IF($A34=\"\",\"\",VLOOKUP($A34,Dateneingabe!$D$11:$P$109,12,FALSE))","v":""}]
[{"$f":"IF('Liste Klasse 1'!A19=\"\",\"\",'Liste Klasse 1'!A19&\" / \"&'Liste Klasse 1'!B19&\" / Klasse 1\")","v":""},{"$f":"IF('Liste Klasse 1'!C19=\"\",\"\",'Liste Klasse 1'!C19)","v":""},{"$f":"IF('Liste Klasse 1'!D19=\"\",\"\",'Liste Klasse 1'!D19)","v":""},{"$f":"IF('Liste Klasse 1'!E19=\"\",\"\",'Liste Klasse 1'!E19)","v":""},{"$f":"IF('Liste Klasse 1'!F19=\"\",\"\",'Liste Klasse 1'!F19)","v":""},{"$f":"IF('Liste Klasse 1'!G19=\"\",\"\",'Liste Klasse 1'!G19)","v":""},{"$f":"IF($A35=\"\",\"\",VLOOKUP($A35,Dateneingabe!$D$11:$P$109,8,FALSE))","v":""},{"$f":"IF($A35=\"\",\"\",VLOOKUP($A35,Dateneingabe!$D$11:$P$109,11,FALSE))","v":""},null,{"$f":"IF($A35=\"\",\"\",VLOOKUP($A35,Dateneingabe!$D$11:$P$109,12,FALSE))","v":""}]
[{"$f":"IF('Liste Klasse 1'!A20=\"\",\"\",'Liste Klasse 1'!A20&\" / \"&'Liste Klasse 1'!B20&\" / Klasse 1\")","v":""},{"$f":"IF('Liste Klasse 1'!C20=\"\",\"\",'Liste Klasse 1'!C20)","v":""},{"$f":"IF('Liste Klasse 1'!D20=\"\",\"\",'Liste Klasse 1'!D20)","v":""},{"$f":"IF('Liste Klasse 1'!E20=\"\",\"\",'Liste Klasse 1'!E20)","v":""},{"$f":"IF('Liste Klasse 1'!F20=\"\",\"\",'Liste Klasse 1'!F20)","v":""},{"$f":"IF('Liste Klasse 1'!G20=\"\",\"\",'Liste Klasse 1'!G20)","v":""},{"$f":"IF($A36=\"\",\"\",VLOOKUP($A36,Dateneingabe!$D$11:$P$109,8,FALSE))","v":""},{"$f":"IF($A36=\"\",\"\",VLOOKUP($A36,Dateneingabe!$D$11:$P$109,11,FALSE))","v":""},null,{"$f":"IF($A36=\"\",\"\",VLOOKUP($A36,Dateneingabe!$D$11:$P$109,12,FALSE))","v":""}]
[{"$f":"IF('Liste Klasse 1'!A21=\"\",\"\",'Liste Klasse 1'!A21&\" / \"&'Liste Klasse 1'!B21&\" / Klasse 1\")","v":""},{"$f":"IF('Liste Klasse 1'!C21=\"\",\"\",'Liste Klasse 1'!C21)","v":""},{"$f":"IF('Liste Klasse 1'!D21=\"\",\"\",'Liste Klasse 1'!D21)","v":""},{"$f":"IF('Liste Klasse 1'!E21=\"\",\"\",'Liste Klasse 1'!E21)","v":""},{"$f":"IF('Liste Klasse 1'!F21=\"\",\"\",'Liste Klasse 1'!F21)","v":""},{"$f":"IF('Liste Klasse 1'!G21=\"\",\"\",'Liste Klasse 1'!G21)","v":""},{"$f":"IF($A37=\"\",\"\",VLOOKUP($A37,Dateneingabe!$D$11:$P$109,8,FALSE))","v":""},{"$f":"IF($A37=\"\",\"\",VLOOKUP($A37,Dateneingabe!$D$11:$P$109,11,FALSE))","v":""},null,{"$f":"IF($A37=\"\",\"\",VLOOKUP($A37,Dateneingabe!$D$11:$P$109,12,FALSE))","v":""}]
[{"$f":"IF('Liste Klasse 1'!A22=\"\",\"\",'Liste Klasse 1'!A22&\" / \"&'Liste Klasse 1'!B22&\" / Klasse 1\")","v":""},{"$f":"IF('Liste Klasse 1'!C22=\"\",\"\",'Liste Klasse 1'!C22)","v":""},{"$f":"IF('Liste Klasse 1'!D22=\"\",\"\",'Liste Klasse 1'!D22)","v":""},{"$f":"IF('Liste Klasse 1'!E22=\"\",\"\",'Liste Klasse 1'!E22)","v":""},{"$f":"IF('Liste Klasse 1'!F22=\"\",\"\",'Liste Klasse 1'!F22)","v":""},{"$f":"IF('Liste Klasse 1'!G22=\"\",\"\",'Liste Klasse 1'!G22)","v":""},{"$f":"IF($A38=\"\",\"\",VLOOKUP($A38,Dateneingabe!$D$11:$P$109,8,FALSE))","v":""},{"$f":"IF($A38=\"\",\"\",VLOOKUP($A38,Dateneingabe!$D$11:$P$109,11,FALSE))","v":""},null,{"$f":"IF($A38=\"\",\"\",VLOOKUP($A38,Dateneingabe!$D$11:$P$109,12,FALSE))","v":""}]
[{"$f":"IF('Liste Klasse 1'!A23=\"\",\"\",'Liste Klasse 1'!A23&\" / \"&'Liste Klasse 1'!B23&\" / Klasse 1\")","v":""},{"$f":"IF('Liste Klasse 1'!C23=\"\",\"\",'Liste Klasse 1'!C23)","v":""},{"$f":"IF('Liste Klasse 1'!D23=\"\",\"\",'Liste Klasse 1'!D23)","v":""},{"$f":"IF('Liste Klasse 1'!E23=\"\",\"\",'Liste Klasse 1'!E23)","v":""},{"$f":"IF('Liste Klasse 1'!F23=\"\",\"\",'Liste Klasse 1'!F23)","v":""},{"$f":"IF('Liste Klasse 1'!G23=\"\",\"\",'Liste Klasse 1'!G23)","v":""},{"$f":"IF($A39=\"\",\"\",VLOOKUP($A39,Dateneingabe!$D$11:$P$109,8,FALSE))","v":""},{"$f":"IF($A39=\"\",\"\",VLOOKUP($A39,Dateneingabe!$D$11:$P$109,11,FALSE))","v":""},null,{"$f":"IF($A39=\"\",\"\",VLOOKUP($A39,Dateneingabe!$D$11:$P$109,12,FALSE))","v":""}]
[{"$f":"IF('Liste Klasse 1'!A24=\"\",\"\",'Liste Klasse 1'!A24&\" / \"&'Liste Klasse 1'!B24&\" / Klasse 1\")","v":""},{"$f":"IF('Liste Klasse 1'!C24=\"\",\"\",'Liste Klasse 1'!C24)","v":""},{"$f":"IF('Liste Klasse 1'!D24=\"\",\"\",'Liste Klasse 1'!D24)","v":""},{"$f":"IF('Liste Klasse 1'!E24=\"\",\"\",'Liste Klasse 1'!E24)","v":""},{"$f":"IF('Liste Klasse 1'!F24=\"\",\"\",'Liste Klasse 1'!F24)","v":""},{"$f":"IF('Liste Klasse 1'!G24=\"\",\"\",'Liste Klasse 1'!G24)","v":""},{"$f":"IF($A40=\"\",\"\",VLOOKUP($A40,Dateneingabe!$D$11:$P$109,8,FALSE))","v":""},{"$f":"IF($A40=\"\",\"\",VLOOKUP($A40,Dateneingabe!$D$11:$P$109,11,FALSE))","v":""},null,{"$f":"IF($A40=\"\",\"\",VLOOKUP($A40,Dateneingabe!$D$11:$P$109,12,FALSE))","v":""}]
[{"$f":"IF('Liste Klasse 1'!A25=\"\",\"\",'Liste Klasse 1'!A25&\" / \"&'Liste Klasse 1'!B25&\" / Klasse 1\")","v":""},{"$f":"IF('Liste Klasse 1'!C25=\"\",\"\",'Liste Klasse 1'!C25)","v":""},{"$f":"IF('Liste Klasse 1'!D25=\"\",\"\",'Liste Klasse 1'!D25)","v":""},{"$f":"IF('Liste Klasse 1'!E25=\"\",\"\",'Liste Klasse 1'!E25)","v":""},{"$f":"IF('Liste Klasse 1'!F25=\"\",\"\",'Liste Klasse 1'!F25)","v":""},{"$f":"IF('Liste Klasse 1'!G25=\"\",\"\",'Liste Klasse 1'!G25)","v":""},{"$f":"IF($A41=\"\",\"\",VLOOKUP($A41,Dateneingabe!$D$11:$P$109,8,FALSE))","v":""},{"$f":"IF($A41=\"\",\"\",VLOOKUP($A41,Dateneingabe!$D$11:$P$109,11,FALSE))","v":""},null,{"$f":"IF($A41=\"\",\"\",VLOOKUP($A41,Dateneingabe!$D$11:$P$109,12,FALSE))","v":""}]
["Klasse 2\nStart / Los / Klasse","Hundeführer/-in","Verein","Verband","Hund","Rasse","SH","Tätowierung",null,"Chipnummer",null,null,null,null,null,null,null,"Geprüft"]
[{"$f":"IF('Liste Klasse 2'!A8=\"\",\"\",'Liste Klasse 2'!A8&\" / \"&'Liste Klasse 2'!B8&\" / Klasse 2\")","v":""},{"$f":"IF('Liste Klasse 2'!C8=\"\",\"\",'Liste Klasse 2'!C8)","v":""},{"$f":"IF('Liste Klasse 2'!D8=\"\",\"\",'Liste Klasse 2'!D8)","v":""},{"$f":"IF('Liste Klasse 2'!E8=\"\",\"\",'Liste Klasse 2'!E8)","v":""},{"$f":"IF('Liste Klasse 2'!F8=\"\",\"\",'Liste Klasse 2'!F8)","v":""},{"$f":"IF('Liste Klasse 2'!G8=\"\",\"\",'Liste Klasse 2'!G8)","v":""},{"$f":"IF($A43=\"\",\"\",VLOOKUP($A43,Dateneingabe!$D$11:$P$109,8,FALSE))","v":""},{"$f":"IF($A43=\"\",\"\",VLOOKUP($A43,Dateneingabe!$D$11:$P$109,11,FALSE))","v":""},null,{"$f":"IF($A43=\"\",\"\",VLOOKUP($A43,Dateneingabe!$D$11:$P$109,12,FALSE))","v":""}]
[{"$f":"IF('Liste Klasse 2'!A9=\"\",\"\",'Liste Klasse 2'!A9&\" / \"&'Liste Klasse 2'!B9&\" / Klasse 2\")","v":""},{"$f":"IF('Liste Klasse 2'!C9=\"\",\"\",'Liste Klasse 2'!C9)","v":""},{"$f":"IF('Liste Klasse 2'!D9=\"\",\"\",'Liste Klasse 2'!D9)","v":""},{"$f":"IF('Liste Klasse 2'!E9=\"\",\"\",'Liste Klasse 2'!E9)","v":""},{"$f":"IF('Liste Klasse 2'!F9=\"\",\"\",'Liste Klasse 2'!F9)","v":""},{"$f":"IF('Liste Klasse 2'!G9=\"\",\"\",'Liste Klasse 2'!G9)","v":""},{"$f":"IF($A44=\"\",\"\",VLOOKUP($A44,Dateneingabe!$D$11:$P$109,8,FALSE))","v":""},{"$f":"IF($A44=\"\",\"\",VLOOKUP($A44,Dateneingabe!$D$11:$P$109,11,FALSE))","v":""},null,{"$f":"IF($A44=\"\",\"\",VLOOKUP($A44,Dateneingabe!$D$11:$P$109,12,FALSE))","v":""}]
[{"$f":"IF('Liste Klasse 2'!A10=\"\",\"\",'Liste Klasse 2'!A10&\" / \"&'Liste Klasse 2'!B10&\" / Klasse 2\")","v":""},{"$f":"IF('Liste Klasse 2'!C10=\"\",\"\",'Liste Klasse 2'!C10)","v":""},{"$f":"IF('Liste Klasse 2'!D10=\"\",\"\",'Liste Klasse 2'!D10)","v":""},{"$f":"IF('Liste Klasse 2'!E10=\"\",\"\",'Liste Klasse 2'!E10)","v":""},{"$f":"IF('Liste Klasse 2'!F10=\"\",\"\",'Liste Klasse 2'!F10)","v":""},{"$f":"IF('Liste Klasse 2'!G10=\"\",\"\",'Liste Klasse 2'!G10)","v":""},{"$f":"IF($A45=\"\",\"\",VLOOKUP($A45,Dateneingabe!$D$11:$P$109,8,FALSE))","v":""},{"$f":"IF($A45=\"\",\"\",VLOOKUP($A45,Dateneingabe!$D$11:$P$109,11,FALSE))","v":""},null,{"$f":"IF($A45=\"\",\"\",VLOOKUP($A45,Dateneingabe!$D$11:$P$109,12,FALSE))","v":""}]
[{"$f":"IF('Liste Klasse 2'!A11=\"\",\"\",'Liste Klasse 2'!A11&\" / \"&'Liste Klasse 2'!B11&\" / Klasse 2\")","v":""},{"$f":"IF('Liste Klasse 2'!C11=\"\",\"\",'Liste Klasse 2'!C11)","v":""},{"$f":"IF('Liste Klasse 2'!D11=\"\",\"\",'Liste Klasse 2'!D11)","v":""},{"$f":"IF('Liste Klasse 2'!E11=\"\",\"\",'Liste Klasse 2'!E11)","v":""},{"$f":"IF('Liste Klasse 2'!F11=\"\",\"\",'Liste Klasse 2'!F11)","v":""},{"$f":"IF('Liste Klasse 2'!G11=\"\",\"\",'Liste Klasse 2'!G11)","v":""},{"$f":"IF($A46=\"\",\"\",VLOOKUP($A46,Dateneingabe!$D$11:$P$109,8,FALSE))","v":""},{"$f":"IF($A46=\"\",\"\",VLOOKUP($A46,Dateneingabe!$D$11:$P$109,11,FALSE))","v":""},null,{"$f":"IF($A46=\"\",\"\",VLOOKUP($A46,Dateneingabe!$D$11:$P$109,12,FALSE))","v":""}]
[{"$f":"IF('Liste Klasse 2'!A12=\"\",\"\",'Liste Klasse 2'!A12&\" / \"&'Liste Klasse 2'!B12&\" / Klasse 2\")","v":""},{"$f":"IF('Liste Klasse 2'!C12=\"\",\"\",'Liste Klasse 2'!C12)","v":""},{"$f":"IF('Liste Klasse 2'!D12=\"\",\"\",'Liste Klasse 2'!D12)","v":""},{"$f":"IF('Liste Klasse 2'!E12=\"\",\"\",'Liste Klasse 2'!E12)","v":""},{"$f":"IF('Liste Klasse 2'!F12=\"\",\"\",'Liste Klasse 2'!F12)","v":""},{"$f":"IF('Liste Klasse 2'!G12=\"\",\"\",'Liste Klasse 2'!G12)","v":""},{"$f":"IF($A47=\"\",\"\",VLOOKUP($A47,Dateneingabe!$D$11:$P$109,8,FALSE))","v":""},{"$f":"IF($A47=\"\",\"\",VLOOKUP($A47,Dateneingabe!$D$11:$P$109,11,FALSE))","v":""},null,{"$f":"IF($A47=\"\",\"\",VLOOKUP($A47,Dateneingabe!$D$11:$P$109,12,FALSE))","v":""}]
[{"$f":"IF('Liste Klasse 2'!A13=\"\",\"\",'Liste Klasse 2'!A13&\" / \"&'Liste Klasse 2'!B13&\" / Klasse 2\")","v":""},{"$f":"IF('Liste Klasse 2'!C13=\"\",\"\",'Liste Klasse 2'!C13)","v":""},{"$f":"IF('Liste Klasse 2'!D13=\"\",\"\",'Liste Klasse 2'!D13)","v":""},{"$f":"IF('Liste Klasse 2'!E13=\"\",\"\",'Liste Klasse 2'!E13)","v":""},{"$f":"IF('Liste Klasse 2'!F13=\"\",\"\",'Liste Klasse 2'!F13)","v":""},{"$f":"IF('Liste Klasse 2'!G13=\"\",\"\",'Liste Klasse 2'!G13)","v":""},{"$f":"IF($A48=\"\",\"\",VLOOKUP($A48,Dateneingabe!$D$11:$P$109,8,FALSE))","v":""},{"$f":"IF($A48=\"\",\"\",VLOOKUP($A48,Dateneingabe!$D$11:$P$109,11,FALSE))","v":""},null,{"$f":"IF($A48=\"\",\"\",VLOOKUP($A48,Dateneingabe!$D$11:$P$109,12,FALSE))","v":""}]
[{"$f":"IF('Liste Klasse 2'!A14=\"\",\"\",'Liste Klasse 2'!A14&\" / \"&'Liste Klasse 2'!B14&\" / Klasse 2\")","v":""},{"$f":"IF('Liste Klasse 2'!C14=\"\",\"\",'Liste Klasse 2'!C14)","v":""},{"$f":"IF('Liste Klasse 2'!D14=\"\",\"\",'Liste Klasse 2'!D14)","v":""},{"$f":"IF('Liste Klasse 2'!E14=\"\",\"\",'Liste Klasse 2'!E14)","v":""},{"$f":"IF('Liste Klasse 2'!F14=\"\",\"\",'Liste Klasse 2'!F14)","v":""},{"$f":"IF('Liste Klasse 2'!G14=\"\",\"\",'Liste Klasse 2'!G14)","v":""},{"$f":"IF($A49=\"\",\"\",VLOOKUP($A49,Dateneingabe!$D$11:$P$109,8,FALSE))","v":""},{"$f":"IF($A49=\"\",\"\",VLOOKUP($A49,Dateneingabe!$D$11:$P$109,11,FALSE))","v":""},null,{"$f":"IF($A49=\"\",\"\",VLOOKUP($A49,Dateneingabe!$D$11:$P$109,12,FALSE))","v":""}]
[{"$f":"IF('Liste Klasse 2'!A15=\"\",\"\",'Liste Klasse 2'!A15&\" / \"&'Liste Klasse 2'!B15&\" / Klasse 2\")","v":""},{"$f":"IF('Liste Klasse 2'!C15=\"\",\"\",'Liste Klasse 2'!C15)","v":""},{"$f":"IF('Liste Klasse 2'!D15=\"\",\"\",'Liste Klasse 2'!D15)","v":""},{"$f":"IF('Liste Klasse 2'!E15=\"\",\"\",'Liste Klasse 2'!E15)","v":""},{"$f":"IF('Liste Klasse 2'!F15=\"\",\"\",'Liste Klasse 2'!F15)","v":""},{"$f":"IF('Liste Klasse 2'!G15=\"\",\"\",'Liste Klasse 2'!G15)","v":""},{"$f":"IF($A50=\"\",\"\",VLOOKUP($A50,Dateneingabe!$D$11:$P$109,8,FALSE))","v":""},{"$f":"IF($A50=\"\",\"\",VLOOKUP($A50,Dateneingabe!$D$11:$P$109,11,FALSE))","v":""},null,{"$f":"IF($A50=\"\",\"\",VLOOKUP($A50,Dateneingabe!$D$11:$P$109,12,FALSE))","v":""}]
[{"$f":"IF('Liste Klasse 2'!A16=\"\",\"\",'Liste Klasse 2'!A16&\" / \"&'Liste Klasse 2'!B16&\" / Klasse 2\")","v":""},{"$f":"IF('Liste Klasse 2'!C16=\"\",\"\",'Liste Klasse 2'!C16)","v":""},{"$f":"IF('Liste Klasse 2'!D16=\"\",\"\",'Liste Klasse 2'!D16)","v":""},{"$f":"IF('Liste Klasse 2'!E16=\"\",\"\",'Liste Klasse 2'!E16)","v":""},{"$f":"IF('Liste Klasse 2'!F16=\"\",\"\",'Liste Klasse 2'!F16)","v":""},{"$f":"IF('Liste Klasse 2'!G16=\"\",\"\",'Liste Klasse 2'!G16)","v":""},{"$f":"IF($A51=\"\",\"\",VLOOKUP($A51,Dateneingabe!$D$11:$P$109,8,FALSE))","v":""},{"$f":"IF($A51=\"\",\"\",VLOOKUP($A51,Dateneingabe!$D$11:$P$109,11,FALSE))","v":""},null,{"$f":"IF($A51=\"\",\"\",VLOOKUP($A51,Dateneingabe!$D$11:$P$109,12,FALSE))","v":""}]
[{"$f":"IF('Liste Klasse 2'!A17=\"\",\"\",'Liste Klasse 2'!A17&\" / \"&'Liste Klasse 2'!B17&\" / Klasse 2\")","v":""},{"$f":"IF('Liste Klasse 2'!C17=\"\",\"\",'Liste Klasse 2'!C17)","v":""},{"$f":"IF('Liste Klasse 2'!D17=\"\",\"\",'Liste Klasse 2'!D17)","v":""},{"$f":"IF('Liste Klasse 2'!E17=\"\",\"\",'Liste Klasse 2'!E17)","v":""},{"$f":"IF('Liste Klasse 2'!F17=\"\",\"\",'Liste Klasse 2'!F17)","v":""},{"$f":"IF('Liste Klasse 2'!G17=\"\",\"\",'Liste Klasse 2'!G17)","v":""},{"$f":"IF($A52=\"\",\"\",VLOOKUP($A52,Dateneingabe!$D$11:$P$109,8,FALSE))","v":""},{"$f":"IF($A52=\"\",\"\",VLOOKUP($A52,Dateneingabe!$D$11:$P$109,11,FALSE))","v":""},null,{"$f":"IF($A52=\"\",\"\",VLOOKUP($A52,Dateneingabe!$D$11:$P$109,12,FALSE))","v":""}]
[{"$f":"IF('Liste Klasse 2'!A18=\"\",\"\",'Liste Klasse 2'!A18&\" / \"&'Liste Klasse 2'!B18&\" / Klasse 2\")","v":""},{"$f":"IF('Liste Klasse 2'!C18=\"\",\"\",'Liste Klasse 2'!C18)","v":""},{"$f":"IF('Liste Klasse 2'!D18=\"\",\"\",'Liste Klasse 2'!D18)","v":""},{"$f":"IF('Liste Klasse 2'!E18=\"\",\"\",'Liste Klasse 2'!E18)","v":""},{"$f":"IF('Liste Klasse 2'!F18=\"\",\"\",'Liste Klasse 2'!F18)","v":""},{"$f":"IF('Liste Klasse 2'!G18=\"\",\"\",'Liste Klasse 2'!G18)","v":""},{"$f":"IF($A53=\"\",\"\",VLOOKUP($A53,Dateneingabe!$D$11:$P$109,8,FALSE))","v":""},{"$f":"IF($A53=\"\",\"\",VLOOKUP($A53,Dateneingabe!$D$11:$P$109,11,FALSE))","v":""},null,{"$f":"IF($A53=\"\",\"\",VLOOKUP($A53,Dateneingabe!$D$11:$P$109,12,FALSE))","v":""}]
[{"$f":"IF('Liste Klasse 2'!A19=\"\",\"\",'Liste Klasse 2'!A19&\" / \"&'Liste Klasse 2'!B19&\" / Klasse 2\")","v":""},{"$f":"IF('Liste Klasse 2'!C19=\"\",\"\",'Liste Klasse 2'!C19)","v":""},{"$f":"IF('Liste Klasse 2'!D19=\"\",\"\",'Liste Klasse 2'!D19)","v":""},{"$f":"IF('Liste Klasse 2'!E19=\"\",\"\",'Liste Klasse 2'!E19)","v":""},{"$f":"IF('Liste Klasse 2'!F19=\"\",\"\",'Liste Klasse 2'!F19)","v":""},{"$f":"IF('Liste Klasse 2'!G19=\"\",\"\",'Liste Klasse 2'!G19)","v":""},{"$f":"IF($A54=\"\",\"\",VLOOKUP($A54,Dateneingabe!$D$11:$P$109,8,FALSE))","v":""},{"$f":"IF($A54=\"\",\"\",VLOOKUP($A54,Dateneingabe!$D$11:$P$109,11,FALSE))","v":""},null,{"$f":"IF($A54=\"\",\"\",VLOOKUP($A54,Dateneingabe!$D$11:$P$109,12,FALSE))","v":""}]
[{"$f":"IF('Liste Klasse 2'!A20=\"\",\"\",'Liste Klasse 2'!A20&\" / \"&'Liste Klasse 2'!B20&\" / Klasse 2\")","v":""},{"$f":"IF('Liste Klasse 2'!C20=\"\",\"\",'Liste Klasse 2'!C20)","v":""},{"$f":"IF('Liste Klasse 2'!D20=\"\",\"\",'Liste Klasse 2'!D20)","v":""},{"$f":"IF('Liste Klasse 2'!E20=\"\",\"\",'Liste Klasse 2'!E20)","v":""},{"$f":"IF('Liste Klasse 2'!F20=\"\",\"\",'Liste Klasse 2'!F20)","v":""},{"$f":"IF('Liste Klasse 2'!G20=\"\",\"\",'Liste Klasse 2'!G20)","v":""},{"$f":"IF($A55=\"\",\"\",VLOOKUP($A55,Dateneingabe!$D$11:$P$109,8,FALSE))","v":""},{"$f":"IF($A55=\"\",\"\",VLOOKUP($A55,Dateneingabe!$D$11:$P$109,11,FALSE))","v":""},null,{"$f":"IF($A55=\"\",\"\",VLOOKUP($A55,Dateneingabe!$D$11:$P$109,12,FALSE))","v":""}]
[{"$f":"IF('Liste Klasse 2'!A21=\"\",\"\",'Liste Klasse 2'!A21&\" / \"&'Liste Klasse 2'!B21&\" / Klasse 2\")","v":""},{"$f":"IF('Liste Klasse 2'!C21=\"\",\"\",'Liste Klasse 2'!C21)","v":""},{"$f":"IF('Liste Klasse 2'!D21=\"\",\"\",'Liste Klasse 2'!D21)","v":""},{"$f":"IF('Liste Klasse 2'!E21=\"\",\"\",'Liste Klasse 2'!E21)","v":""},{"$f":"IF('Liste Klasse 2'!F21=\"\",\"\",'Liste Klasse 2'!F21)","v":""},{"$f":"IF('Liste Klasse 2'!G21=\"\",\"\",'Liste Klasse 2'!G21)","v":""},{"$f":"IF($A56=\"\",\"\",VLOOKUP($A56,Dateneingabe!$D$11:$P$109,8,FALSE))","v":""},{"$f":"IF($A56=\"\",\"\",VLOOKUP($A56,Dateneingabe!$D$11:$P$109,11,FALSE))","v":""},null,{"$f":"IF($A56=\"\",\"\",VLOOKUP($A56,Dateneingabe!$D$11:$P$109,12,FALSE))","v":""}]
[{"$f":"IF('Liste Klasse 2'!A22=\"\",\"\",'Liste Klasse 2'!A22&\" / \"&'Liste Klasse 2'!B22&\" / Klasse 2\")","v":""},{"$f":"IF('Liste Klasse 2'!C22=\"\",\"\",'Liste Klasse 2'!C22)","v":""},{"$f":"IF('Liste Klasse 2'!D22=\"\",\"\",'Liste Klasse 2'!D22)","v":""},{"$f":"IF('Liste Klasse 2'!E22=\"\",\"\",'Liste Klasse 2'!E22)","v":""},{"$f":"IF('Liste Klasse 2'!F22=\"\",\"\",'Liste Klasse 2'!F22)","v":""},{"$f":"IF('Liste Klasse 2'!G22=\"\",\"\",'Liste Klasse 2'!G22)","v":""},{"$f":"IF($A57=\"\",\"\",VLOOKUP($A57,Dateneingabe!$D$11:$P$109,8,FALSE))","v":""},{"$f":"IF($A57=\"\",\"\",VLOOKUP($A57,Dateneingabe!$D$11:$P$109,11,FALSE))","v":""},null,{"$f":"IF($A57=\"\",\"\",VLOOKUP($A57,Dateneingabe!$D$11:$P$109,12,FALSE))","v":""}]
[{"$f":"IF('Liste Klasse 2'!A23=\"\",\"\",'Liste Klasse 2'!A23&\" / \"&'Liste Klasse 2'!B23&\" / Klasse 2\")","v":""},{"$f":"IF('Liste Klasse 2'!C23=\"\",\"\",'Liste Klasse 2'!C23)","v":""},{"$f":"IF('Liste Klasse 2'!D23=\"\",\"\",'Liste Klasse 2'!D23)","v":""},{"$f":"IF('Liste Klasse 2'!E23=\"\",\"\",'Liste Klasse 2'!E23)","v":""},{"$f":"IF('Liste Klasse 2'!F23=\"\",\"\",'Liste Klasse 2'!F23)","v":""},{"$f":"IF('Liste Klasse 2'!G23=\"\",\"\",'Liste Klasse 2'!G23)","v":""},{"$f":"IF($A58=\"\",\"\",VLOOKUP($A58,Dateneingabe!$D$11:$P$109,8,FALSE))","v":""},{"$f":"IF($A58=\"\",\"\",VLOOKUP($A58,Dateneingabe!$D$11:$P$109,11,FALSE))","v":""},null,{"$f":"IF($A58=\"\",\"\",VLOOKUP($A58,Dateneingabe!$D$11:$P$109,12,FALSE))","v":""}]
[{"$f":"IF('Liste Klasse 2'!A24=\"\",\"\",'Liste Klasse 2'!A24&\" / \"&'Liste Klasse 2'!B24&\" / Klasse 2\")","v":""},{"$f":"IF('Liste Klasse 2'!C24=\"\",\"\",'Liste Klasse 2'!C24)","v":""},{"$f":"IF('Liste Klasse 2'!D24=\"\",\"\",'Liste Klasse 2'!D24)","v":""},{"$f":"IF('Liste Klasse 2'!E24=\"\",\"\",'Liste Klasse 2'!E24)","v":""},{"$f":"IF('Liste Klasse 2'!F24=\"\",\"\",'Liste Klasse 2'!F24)","v":""},{"$f":"IF('Liste Klasse 2'!G24=\"\",\"\",'Liste Klasse 2'!G24)","v":""},{"$f":"IF($A59=\"\",\"\",VLOOKUP($A59,Dateneingabe!$D$11:$P$109,8,FALSE))","v":""},{"$f":"IF($A59=\"\",\"\",VLOOKUP($A59,Dateneingabe!$D$11:$P$109,11,FALSE))","v":""},null,{"$f":"IF($A59=\"\",\"\",VLOOKUP($A59,Dateneingabe!$D$11:$P$109,12,FALSE))","v":""}]
[{"$f":"IF('Liste Klasse 2'!A25=\"\",\"\",'Liste Klasse 2'!A25&\" / \"&'Liste Klasse 2'!B25&\" / Klasse 2\")","v":""},{"$f":"IF('Liste Klasse 2'!C25=\"\",\"\",'Liste Klasse 2'!C25)","v":""},{"$f":"IF('Liste Klasse 2'!D25=\"\",\"\",'Liste Klasse 2'!D25)","v":""},{"$f":"IF('Liste Klasse 2'!E25=\"\",\"\",'Liste Klasse 2'!E25)","v":""},{"$f":"IF('Liste Klasse 2'!F25=\"\",\"\",'Liste Klasse 2'!F25)","v":""},{"$f":"IF('Liste Klasse 2'!G25=\"\",\"\",'Liste Klasse 2'!G25)","v":""},{"$f":"IF($A60=\"\",\"\",VLOOKUP($A60,Dateneingabe!$D$11:$P$109,8,FALSE))","v":""},{"$f":"IF($A60=\"\",\"\",VLOOKUP($A60,Dateneingabe!$D$11:$P$109,11,FALSE))","v":""},null,{"$f":"IF($A60=\"\",\"\",VLOOKUP($A60,Dateneingabe!$D$11:$P$109,12,FALSE))","v":""}]
["Klasse 3\nStart / Los / Klasse","Hundeführer/-in","Verein","Verband","Hund","Rasse","SH","Tätowierung",null,"Chipnummer",null,null,null,null,null,null,null,"Geprüft"]
[{"$f":"IF('Liste Klasse 3'!A8=\"\",\"\",'Liste Klasse 3'!A8&\" / \"&'Liste Klasse 3'!B8&\" / Klasse 3\")","v":""},{"$f":"IF('Liste Klasse 3'!C8=\"\",\"\",'Liste Klasse 3'!C8)","v":""},{"$f":"IF('Liste Klasse 3'!D8=\"\",\"\",'Liste Klasse 3'!D8)","v":""},{"$f":"IF('Liste Klasse 3'!E8=\"\",\"\",'Liste Klasse 3'!E8)","v":""},{"$f":"IF('Liste Klasse 3'!F8=\"\",\"\",'Liste Klasse 3'!F8)","v":""},{"$f":"IF('Liste Klasse 3'!G8=\"\",\"\",'Liste Klasse 3'!G8)","v":""},{"$f":"IF($A62=\"\",\"\",VLOOKUP($A62,Dateneingabe!$D$11:$P$109,8,FALSE))","v":""},{"$f":"IF($A62=\"\",\"\",VLOOKUP($A62,Dateneingabe!$D$11:$P$109,11,FALSE))","v":""},null,{"$f":"IF($A62=\"\",\"\",VLOOKUP($A62,Dateneingabe!$D$11:$P$109,12,FALSE))","v":""}]
[{"$f":"IF('Liste Klasse 3'!A9=\"\",\"\",'Liste Klasse 3'!A9&\" / \"&'Liste Klasse 3'!B9&\" / Klasse 3\")","v":""},{"$f":"IF('Liste Klasse 3'!C9=\"\",\"\",'Liste Klasse 3'!C9)","v":""},{"$f":"IF('Liste Klasse 3'!D9=\"\",\"\",'Liste Klasse 3'!D9)","v":""},{"$f":"IF('Liste Klasse 3'!E9=\"\",\"\",'Liste Klasse 3'!E9)","v":""},{"$f":"IF('Liste Klasse 3'!F9=\"\",\"\",'Liste Klasse 3'!F9)","v":""},{"$f":"IF('Liste Klasse 3'!G9=\"\",\"\",'Liste Klasse 3'!G9)","v":""},{"$f":"IF($A63=\"\",\"\",VLOOKUP($A63,Dateneingabe!$D$11:$P$109,8,FALSE))","v":""},{"$f":"IF($A63=\"\",\"\",VLOOKUP($A63,Dateneingabe!$D$11:$P$109,11,FALSE))","v":""},null,{"$f":"IF($A63=\"\",\"\",VLOOKUP($A63,Dateneingabe!$D$11:$P$109,12,FALSE))","v":""}]
[{"$f":"IF('Liste Klasse 3'!A10=\"\",\"\",'Liste Klasse 3'!A10&\" / \"&'Liste Klasse 3'!B10&\" / Klasse 3\")","v":""},{"$f":"IF('Liste Klasse 3'!C10=\"\",\"\",'Liste Klasse 3'!C10)","v":""},{"$f":"IF('Liste Klasse 3'!D10=\"\",\"\",'Liste Klasse 3'!D10)","v":""},{"$f":"IF('Liste Klasse 3'!E10=\"\",\"\",'Liste Klasse 3'!E10)","v":""},{"$f":"IF('Liste Klasse 3'!F10=\"\",\"\",'Liste Klasse 3'!F10)","v":""},{"$f":"IF('Liste Klasse 3'!G10=\"\",\"\",'Liste Klasse 3'!G10)","v":""},{"$f":"IF($A64=\"\",\"\",VLOOKUP($A64,Dateneingabe!$D$11:$P$109,8,FALSE))","v":""},{"$f":"IF($A64=\"\",\"\",VLOOKUP($A64,Dateneingabe!$D$11:$P$109,11,FALSE))","v":""},null,{"$f":"IF($A64=\"\",\"\",VLOOKUP($A64,Dateneingabe!$D$11:$P$109,12,FALSE))","v":""}]
[{"$f":"IF('Liste Klasse 3'!A11=\"\",\"\",'Liste Klasse 3'!A11&\" / \"&'Liste Klasse 3'!B11&\" / Klasse 3\")","v":""},{"$f":"IF('Liste Klasse 3'!C11=\"\",\"\",'Liste Klasse 3'!C11)","v":""},{"$f":"IF('Liste Klasse 3'!D11=\"\",\"\",'Liste Klasse 3'!D11)","v":""},{"$f":"IF('Liste Klasse 3'!E11=\"\",\"\",'Liste Klasse 3'!E11)","v":""},{"$f":"IF('Liste Klasse 3'!F11=\"\",\"\",'Liste Klasse 3'!F11)","v":""},{"$f":"IF('Liste Klasse 3'!G11=\"\",\"\",'Liste Klasse 3'!G11)","v":""},{"$f":"IF($A65=\"\",\"\",VLOOKUP($A65,Dateneingabe!$D$11:$P$109,8,FALSE))","v":""},{"$f":"IF($A65=\"\",\"\",VLOOKUP($A65,Dateneingabe!$D$11:$P$109,11,FALSE))","v":""},null,{"$f":"IF($A65=\"\",\"\",VLOOKUP($A65,Dateneingabe!$D$11:$P$109,12,FALSE))","v":""}]
[{"$f":"IF('Liste Klasse 3'!A12=\"\",\"\",'Liste Klasse 3'!A12&\" / \"&'Liste Klasse 3'!B12&\" / Klasse 3\")","v":""},{"$f":"IF('Liste Klasse 3'!C12=\"\",\"\",'Liste Klasse 3'!C12)","v":""},{"$f":"IF('Liste Klasse 3'!D12=\"\",\"\",'Liste Klasse 3'!D12)","v":""},{"$f":"IF('Liste Klasse 3'!E12=\"\",\"\",'Liste Klasse 3'!E12)","v":""},{"$f":"IF('Liste Klasse 3'!F12=\"\",\"\",'Liste Klasse 3'!F12)","v":""},{"$f":"IF('Liste Klasse 3'!G12=\"\",\"\",'Liste Klasse 3'!G12)","v":""},{"$f":"IF($A66=\"\",\"\",VLOOKUP($A66,Dateneingabe!$D$11:$P$109,8,FALSE))","v":""},{"$f":"IF($A66=\"\",\"\",VLOOKUP($A66,Dateneingabe!$D$11:$P$109,11,FALSE))","v":""},null,{"$f":"IF($A66=\"\",\"\",VLOOKUP($A66,Dateneingabe!$D$11:$P$109,12,FALSE))","v":""}]
[{"$f":"IF('Liste Klasse 3'!A13=\"\",\"\",'Liste Klasse 3'!A13&\" / \"&'Liste Klasse 3'!B13&\" / Klasse 3\")","v":""},{"$f":"IF('Liste Klasse 3'!C13=\"\",\"\",'Liste Klasse 3'!C13)","v":""},{"$f":"IF('Liste Klasse 3'!D13=\"\",\"\",'Liste Klasse 3'!D13)","v":""},{"$f":"IF('Liste Klasse 3'!E13=\"\",\"\",'Liste Klasse 3'!E13)","v":""},{"$f":"IF('Liste Klasse 3'!F13=\"\",\"\",'Liste Klasse 3'!F13)","v":""},{"$f":"IF('Liste Klasse 3'!G13=\"\",\"\",'Liste Klasse 3'!G13)","v":""},{"$f":"IF($A67=\"\",\"\",VLOOKUP($A67,Dateneingabe!$D$11:$P$109,8,FALSE))","v":""},{"$f":"IF($A67=\"\",\"\",VLOOKUP($A67,Dateneingabe!$D$11:$P$109,11,FALSE))","v":""},null,{"$f":"IF($A67=\"\",\"\",VLOOKUP($A67,Dateneingabe!$D$11:$P$109,12,FALSE))","v":""}]
[{"$f":"IF('Liste Klasse 3'!A14=\"\",\"\",'Liste Klasse 3'!A14&\" / \"&'Liste Klasse 3'!B14&\" / Klasse 3\")","v":""},{"$f":"IF('Liste Klasse 3'!C14=\"\",\"\",'Liste Klasse 3'!C14)","v":""},{"$f":"IF('Liste Klasse 3'!D14=\"\",\"\",'Liste Klasse 3'!D14)","v":""},{"$f":"IF('Liste Klasse 3'!E14=\"\",\"\",'Liste Klasse 3'!E14)","v":""},{"$f":"IF('Liste Klasse 3'!F14=\"\",\"\",'Liste Klasse 3'!F14)","v":""},{"$f":"IF('Liste Klasse 3'!G14=\"\",\"\",'Liste Klasse 3'!G14)","v":""},{"$f":"IF($A68=\"\",\"\",VLOOKUP($A68,Dateneingabe!$D$11:$P$109,8,FALSE))","v":""},{"$f":"IF($A68=\"\",\"\",VLOOKUP($A68,Dateneingabe!$D$11:$P$109,11,FALSE))","v":""},null,{"$f":"IF($A68=\"\",\"\",VLOOKUP($A68,Dateneingabe!$D$11:$P$109,12,FALSE))","v":""}]
[{"$f":"IF('Liste Klasse 3'!A15=\"\",\"\",'Liste Klasse 3'!A15&\" / \"&'Liste Klasse 3'!B15&\" / Klasse 3\")","v":""},{"$f":"IF('Liste Klasse 3'!C15=\"\",\"\",'Liste Klasse 3'!C15)","v":""},{"$f":"IF('Liste Klasse 3'!D15=\"\",\"\",'Liste Klasse 3'!D15)","v":""},{"$f":"IF('Liste Klasse 3'!E15=\"\",\"\",'Liste Klasse 3'!E15)","v":""},{"$f":"IF('Liste Klasse 3'!F15=\"\",\"\",'Liste Klasse 3'!F15)","v":""},{"$f":"IF('Liste Klasse 3'!G15=\"\",\"\",'Liste Klasse 3'!G15)","v":""},{"$f":"IF($A69=\"\",\"\",VLOOKUP($A69,Dateneingabe!$D$11:$P$109,8,FALSE))","v":""},{"$f":"IF($A69=\"\",\"\",VLOOKUP($A69,Dateneingabe!$D$11:$P$109,11,FALSE))","v":""},null,{"$f":"IF($A69=\"\",\"\",VLOOKUP($A69,Dateneingabe!$D$11:$P$109,12,FALSE))","v":""}]
[{"$f":"IF('Liste Klasse 3'!A16=\"\",\"\",'Liste Klasse 3'!A16&\" / \"&'Liste Klasse 3'!B16&\" / Klasse 3\")","v":""},{"$f":"IF('Liste Klasse 3'!C16=\"\",\"\",'Liste Klasse 3'!C16)","v":""},{"$f":"IF('Liste Klasse 3'!D16=\"\",\"\",'Liste Klasse 3'!D16)","v":""},{"$f":"IF('Liste Klasse 3'!E16=\"\",\"\",'Liste Klasse 3'!E16)","v":""},{"$f":"IF('Liste Klasse 3'!F16=\"\",\"\",'Liste Klasse 3'!F16)","v":""},{"$f":"IF('Liste Klasse 3'!G16=\"\",\"\",'Liste Klasse 3'!G16)","v":""},{"$f":"IF($A70=\"\",\"\",VLOOKUP($A70,Dateneingabe!$D$11:$P$109,8,FALSE))","v":""},{"$f":"IF($A70=\"\",\"\",VLOOKUP($A70,Dateneingabe!$D$11:$P$109,11,FALSE))","v":""},null,{"$f":"IF($A70=\"\",\"\",VLOOKUP($A70,Dateneingabe!$D$11:$P$109,12,FALSE))","v":""}]
[{"$f":"IF('Liste Klasse 3'!A17=\"\",\"\",'Liste Klasse 3'!A17&\" / \"&'Liste Klasse 3'!B17&\" / Klasse 3\")","v":""},{"$f":"IF('Liste Klasse 3'!C17=\"\",\"\",'Liste Klasse 3'!C17)","v":""},{"$f":"IF('Liste Klasse 3'!D17=\"\",\"\",'Liste Klasse 3'!D17)","v":""},{"$f":"IF('Liste Klasse 3'!E17=\"\",\"\",'Liste Klasse 3'!E17)","v":""},{"$f":"IF('Liste Klasse 3'!F17=\"\",\"\",'Liste Klasse 3'!F17)","v":""},{"$f":"IF('Liste Klasse 3'!G17=\"\",\"\",'Liste Klasse 3'!G17)","v":""},{"$f":"IF($A71=\"\",\"\",VLOOKUP($A71,Dateneingabe!$D$11:$P$109,8,FALSE))","v":""},{"$f":"IF($A71=\"\",\"\",VLOOKUP($A71,Dateneingabe!$D$11:$P$109,11,FALSE))","v":""},null,{"$f":"IF($A71=\"\",\"\",VLOOKUP($A71,Dateneingabe!$D$11:$P$109,12,FALSE))","v":""}]
[{"$f":"IF('Liste Klasse 3'!A18=\"\",\"\",'Liste Klasse 3'!A18&\" / \"&'Liste Klasse 3'!B18&\" / Klasse 3\")","v":""},{"$f":"IF('Liste Klasse 3'!C18=\"\",\"\",'Liste Klasse 3'!C18)","v":""},{"$f":"IF('Liste Klasse 3'!D18=\"\",\"\",'Liste Klasse 3'!D18)","v":""},{"$f":"IF('Liste Klasse 3'!E18=\"\",\"\",'Liste Klasse 3'!E18)","v":""},{"$f":"IF('Liste Klasse 3'!F18=\"\",\"\",'Liste Klasse 3'!F18)","v":""},{"$f":"IF('Liste Klasse 3'!G18=\"\",\"\",'Liste Klasse 3'!G18)","v":""},{"$f":"IF($A72=\"\",\"\",VLOOKUP($A72,Dateneingabe!$D$11:$P$109,8,FALSE))","v":""},{"$f":"IF($A72=\"\",\"\",VLOOKUP($A72,Dateneingabe!$D$11:$P$109,11,FALSE))","v":""},null,{"$f":"IF($A72=\"\",\"\",VLOOKUP($A72,Dateneingabe!$D$11:$P$109,12,FALSE))","v":""}]
[{"$f":"IF('Liste Klasse 3'!A19=\"\",\"\",'Liste Klasse 3'!A19&\" / \"&'Liste Klasse 3'!B19&\" / Klasse 3\")","v":""},{"$f":"IF('Liste Klasse 3'!C19=\"\",\"\",'Liste Klasse 3'!C19)","v":""},{"$f":"IF('Liste Klasse 3'!D19=\"\",\"\",'Liste Klasse 3'!D19)","v":""},{"$f":"IF('Liste Klasse 3'!E19=\"\",\"\",'Liste Klasse 3'!E19)","v":""},{"$f":"IF('Liste Klasse 3'!F19=\"\",\"\",'Liste Klasse 3'!F19)","v":""},{"$f":"IF('Liste Klasse 3'!G19=\"\",\"\",'Liste Klasse 3'!G19)","v":""},{"$f":"IF($A73=\"\",\"\",VLOOKUP($A73,Dateneingabe!$D$11:$P$109,8,FALSE))","v":""},{"$f":"IF($A73=\"\",\"\",VLOOKUP($A73,Dateneingabe!$D$11:$P$109,11,FALSE))","v":""},null,{"$f":"IF($A73=\"\",\"\",VLOOKUP($A73,Dateneingabe!$D$11:$P$109,12,FALSE))","v":""}]
[{"$f":"IF('Liste Klasse 3'!A20=\"\",\"\",'Liste Klasse 3'!A20&\" / \"&'Liste Klasse 3'!B20&\" / Klasse 3\")","v":""},{"$f":"IF('Liste Klasse 3'!C20=\"\",\"\",'Liste Klasse 3'!C20)","v":""},{"$f":"IF('Liste Klasse 3'!D20=\"\",\"\",'Liste Klasse 3'!D20)","v":""},{"$f":"IF('Liste Klasse 3'!E20=\"\",\"\",'Liste Klasse 3'!E20)","v":""},{"$f":"IF('Liste Klasse 3'!F20=\"\",\"\",'Liste Klasse 3'!F20)","v":""},{"$f":"IF('Liste Klasse 3'!G20=\"\",\"\",'Liste Klasse 3'!G20)","v":""},{"$f":"IF($A74=\"\",\"\",VLOOKUP($A74,Dateneingabe!$D$11:$P$109,8,FALSE))","v":""},{"$f":"IF($A74=\"\",\"\",VLOOKUP($A74,Dateneingabe!$D$11:$P$109,11,FALSE))","v":""},null,{"$f":"IF($A74=\"\",\"\",VLOOKUP($A74,Dateneingabe!$D$11:$P$109,12,FALSE))","v":""}]
[{"$f":"IF('Liste Klasse 3'!A21=\"\",\"\",'Liste Klasse 3'!A21&\" / \"&'Liste Klasse 3'!B21&\" / Klasse 3\")","v":""},{"$f":"IF('Liste Klasse 3'!C21=\"\",\"\",'Liste Klasse 3'!C21)","v":""},{"$f":"IF('Liste Klasse 3'!D21=\"\",\"\",'Liste Klasse 3'!D21)","v":""},{"$f":"IF('Liste Klasse 3'!E21=\"\",\"\",'Liste Klasse 3'!E21)","v":""},{"$f":"IF('Liste Klasse 3'!F21=\"\",\"\",'Liste Klasse 3'!F21)","v":""},{"$f":"IF('Liste Klasse 3'!G21=\"\",\"\",'Liste Klasse 3'!G21)","v":""},{"$f":"IF($A75=\"\",\"\",VLOOKUP($A75,Dateneingabe!$D$11:$P$109,8,FALSE))","v":""},{"$f":"IF($A75=\"\",\"\",VLOOKUP($A75,Dateneingabe!$D$11:$P$109,11,FALSE))","v":""},null,{"$f":"IF($A75=\"\",\"\",VLOOKUP($A75,Dateneingabe!$D$11:$P$109,12,FALSE))","v":""}]
[{"$f":"IF('Liste Klasse 3'!A22=\"\",\"\",'Liste Klasse 3'!A22&\" / \"&'Liste Klasse 3'!B22&\" / Klasse 3\")","v":""},{"$f":"IF('Liste Klasse 3'!C22=\"\",\"\",'Liste Klasse 3'!C22)","v":""},{"$f":"IF('Liste Klasse 3'!D22=\"\",\"\",'Liste Klasse 3'!D22)","v":""},{"$f":"IF('Liste Klasse 3'!E22=\"\",\"\",'Liste Klasse 3'!E22)","v":""},{"$f":"IF('Liste Klasse 3'!F22=\"\",\"\",'Liste Klasse 3'!F22)","v":""},{"$f":"IF('Liste Klasse 3'!G22=\"\",\"\",'Liste Klasse 3'!G22)","v":""},{"$f":"IF($A76=\"\",\"\",VLOOKUP($A76,Dateneingabe!$D$11:$P$109,8,FALSE))","v":""},{"$f":"IF($A76=\"\",\"\",VLOOKUP($A76,Dateneingabe!$D$11:$P$109,11,FALSE))","v":""},null,{"$f":"IF($A76=\"\",\"\",VLOOKUP($A76,Dateneingabe!$D$11:$P$109,12,FALSE))","v":""}]
[{"$f":"IF('Liste Klasse 3'!A23=\"\",\"\",'Liste Klasse 3'!A23&\" / \"&'Liste Klasse 3'!B23&\" / Klasse 3\")","v":""},{"$f":"IF('Liste Klasse 3'!C23=\"\",\"\",'Liste Klasse 3'!C23)","v":""},{"$f":"IF('Liste Klasse 3'!D23=\"\",\"\",'Liste Klasse 3'!D23)","v":""},{"$f":"IF('Liste Klasse 3'!E23=\"\",\"\",'Liste Klasse 3'!E23)","v":""},{"$f":"IF('Liste Klasse 3'!F23=\"\",\"\",'Liste Klasse 3'!F23)","v":""},{"$f":"IF('Liste Klasse 3'!G23=\"\",\"\",'Liste Klasse 3'!G23)","v":""},{"$f":"IF($A77=\"\",\"\",VLOOKUP($A77,Dateneingabe!$D$11:$P$109,8,FALSE))","v":""},{"$f":"IF($A77=\"\",\"\",VLOOKUP($A77,Dateneingabe!$D$11:$P$109,11,FALSE))","v":""},null,{"$f":"IF($A77=\"\",\"\",VLOOKUP($A77,Dateneingabe!$D$11:$P$109,12,FALSE))","v":""}]
[{"$f":"IF('Liste Klasse 3'!A24=\"\",\"\",'Liste Klasse 3'!A24&\" / \"&'Liste Klasse 3'!B24&\" / Klasse 3\")","v":""},{"$f":"IF('Liste Klasse 3'!C24=\"\",\"\",'Liste Klasse 3'!C24)","v":""},{"$f":"IF('Liste Klasse 3'!D24=\"\",\"\",'Liste Klasse 3'!D24)","v":""},{"$f":"IF('Liste Klasse 3'!E24=\"\",\"\",'Liste Klasse 3'!E24)","v":""},{"$f":"IF('Liste Klasse 3'!F24=\"\",\"\",'Liste Klasse 3'!F24)","v":""},{"$f":"IF('Liste Klasse 3'!G24=\"\",\"\",'Liste Klasse 3'!G24)","v":""},{"$f":"IF($A78=\"\",\"\",VLOOKUP($A78,Dateneingabe!$D$11:$P$109,8,FALSE))","v":""},{"$f":"IF($A78=\"\",\"\",VLOOKUP($A78,Dateneingabe!$D$11:$P$109,11,FALSE))","v":""},null,{"$f":"IF($A78=\"\",\"\",VLOOKUP($A78,Dateneingabe!$D$11:$P$109,12,FALSE))","v":""}]
[{"$f":"IF('Liste Klasse 3'!A25=\"\",\"\",'Liste Klasse 3'!A25&\" / \"&'Liste Klasse 3'!B25&\" / Klasse 3\")","v":""},{"$f":"IF('Liste Klasse 3'!C25=\"\",\"\",'Liste Klasse 3'!C25)","v":""},{"$f":"IF('Liste Klasse 3'!D25=\"\",\"\",'Liste Klasse 3'!D25)","v":""},{"$f":"IF('Liste Klasse 3'!E25=\"\",\"\",'Liste Klasse 3'!E25)","v":""},{"$f":"IF('Liste Klasse 3'!F25=\"\",\"\",'Liste Klasse 3'!F25)","v":""},{"$f":"IF('Liste Klasse 3'!G25=\"\",\"\",'Liste Klasse 3'!G25)","v":""},{"$f":"IF($A79=\"\",\"\",VLOOKUP($A79,Dateneingabe!$D$11:$P$109,8,FALSE))","v":""},{"$f":"IF($A79=\"\",\"\",VLOOKUP($A79,Dateneingabe!$D$11:$P$109,11,FALSE))","v":""},null,{"$f":"IF($A79=\"\",\"\",VLOOKUP($A79,Dateneingabe!$D$11:$P$109,12,FALSE))","v":""}]
["Klasse Senior\nStart / Los / Klasse","Hundeführer/-in","Verein","Verband","Hund","Rasse","SH","Tätowierung",null,"Chipnummer",null,null,null,null,null,null,null,"Geprüft"]
[{"$f":"IF('Liste Klasse S'!A8=\"\",\"\",'Liste Klasse S'!A8&\" / \"&'Liste Klasse S'!B8&\" / Klasse S\")","v":""},{"$f":"IF('Liste Klasse S'!C8=\"\",\"\",'Liste Klasse S'!C8)","v":""},{"$f":"IF('Liste Klasse S'!D8=\"\",\"\",'Liste Klasse S'!D8)","v":""},{"$f":"IF('Liste Klasse S'!E8=\"\",\"\",'Liste Klasse S'!E8)","v":""},{"$f":"IF('Liste Klasse S'!F8=\"\",\"\",'Liste Klasse S'!F8)","v":""},{"$f":"IF('Liste Klasse S'!G8=\"\",\"\",'Liste Klasse S'!G8)","v":""},{"$f":"IF($A81=\"\",\"\",VLOOKUP($A81,Dateneingabe!$D$11:$P$109,8,FALSE))","v":""},{"$f":"IF($A81=\"\",\"\",VLOOKUP($A81,Dateneingabe!$D$11:$P$109,11,FALSE))","v":""},null,{"$f":"IF($A81=\"\",\"\",VLOOKUP($A81,Dateneingabe!$D$11:$P$109,12,FALSE))","v":""}]
[{"$f":"IF('Liste Klasse S'!A9=\"\",\"\",'Liste Klasse S'!A9&\" / \"&'Liste Klasse S'!B9&\" / Klasse S\")","v":""},{"$f":"IF('Liste Klasse S'!C9=\"\",\"\",'Liste Klasse S'!C9)","v":""},{"$f":"IF('Liste Klasse S'!D9=\"\",\"\",'Liste Klasse S'!D9)","v":""},{"$f":"IF('Liste Klasse S'!E9=\"\",\"\",'Liste Klasse S'!E9)","v":""},{"$f":"IF('Liste Klasse S'!F9=\"\",\"\",'Liste Klasse S'!F9)","v":""},{"$f":"IF('Liste Klasse S'!G9=\"\",\"\",'Liste Klasse S'!G9)","v":""},{"$f":"IF($A82=\"\",\"\",VLOOKUP($A82,Dateneingabe!$D$11:$P$109,8,FALSE))","v":""},{"$f":"IF($A82=\"\",\"\",VLOOKUP($A82,Dateneingabe!$D$11:$P$109,11,FALSE))","v":""},null,{"$f":"IF($A82=\"\",\"\",VLOOKUP($A82,Dateneingabe!$D$11:$P$109,12,FALSE))","v":""}]
[{"$f":"IF('Liste Klasse S'!A10=\"\",\"\",'Liste Klasse S'!A10&\" / \"&'Liste Klasse S'!B10&\" / Klasse S\")","v":""},{"$f":"IF('Liste Klasse S'!C10=\"\",\"\",'Liste Klasse S'!C10)","v":""},{"$f":"IF('Liste Klasse S'!D10=\"\",\"\",'Liste Klasse S'!D10)","v":""},{"$f":"IF('Liste Klasse S'!E10=\"\",\"\",'Liste Klasse S'!E10)","v":""},{"$f":"IF('Liste Klasse S'!F10=\"\",\"\",'Liste Klasse S'!F10)","v":""},{"$f":"IF('Liste Klasse S'!G10=\"\",\"\",'Liste Klasse S'!G10)","v":""},{"$f":"IF($A83=\"\",\"\",VLOOKUP($A83,Dateneingabe!$D$11:$P$109,8,FALSE))","v":""},{"$f":"IF($A83=\"\",\"\",VLOOKUP($A83,Dateneingabe!$D$11:$P$109,11,FALSE))","v":""},null,{"$f":"IF($A83=\"\",\"\",VLOOKUP($A83,Dateneingabe!$D$11:$P$109,12,FALSE))","v":""}]
[{"$f":"IF('Liste Klasse S'!A11=\"\",\"\",'Liste Klasse S'!A11&\" / \"&'Liste Klasse S'!B11&\" / Klasse S\")","v":""},{"$f":"IF('Liste Klasse S'!C11=\"\",\"\",'Liste Klasse S'!C11)","v":""},{"$f":"IF('Liste Klasse S'!D11=\"\",\"\",'Liste Klasse S'!D11)","v":""},{"$f":"IF('Liste Klasse S'!E11=\"\",\"\",'Liste Klasse S'!E11)","v":""},{"$f":"IF('Liste Klasse S'!F11=\"\",\"\",'Liste Klasse S'!F11)","v":""},{"$f":"IF('Liste Klasse S'!G11=\"\",\"\",'Liste Klasse S'!G11)","v":""},{"$f":"IF($A84=\"\",\"\",VLOOKUP($A84,Dateneingabe!$D$11:$P$109,8,FALSE))","v":""},{"$f":"IF($A84=\"\",\"\",VLOOKUP($A84,Dateneingabe!$D$11:$P$109,11,FALSE))","v":""},null,{"$f":"IF($A84=\"\",\"\",VLOOKUP($A84,Dateneingabe!$D$11:$P$109,12,FALSE))","v":""}]
[{"$f":"IF('Liste Klasse S'!A12=\"\",\"\",'Liste Klasse S'!A12&\" / \"&'Liste Klasse S'!B12&\" / Klasse S\")","v":""},{"$f":"IF('Liste Klasse S'!C12=\"\",\"\",'Liste Klasse S'!C12)","v":""},{"$f":"IF('Liste Klasse S'!D12=\"\",\"\",'Liste Klasse S'!D12)","v":""},{"$f":"IF('Liste Klasse S'!E12=\"\",\"\",'Liste Klasse S'!E12)","v":""},{"$f":"IF('Liste Klasse S'!F12=\"\",\"\",'Liste Klasse S'!F12)","v":""},{"$f":"IF('Liste Klasse S'!G12=\"\",\"\",'Liste Klasse S'!G12)","v":""},{"$f":"IF($A85=\"\",\"\",VLOOKUP($A85,Dateneingabe!$D$11:$P$109,8,FALSE))","v":""},{"$f":"IF($A85=\"\",\"\",VLOOKUP($A85,Dateneingabe!$D$11:$P$109,11,FALSE))","v":""},null,{"$f":"IF($A85=\"\",\"\",VLOOKUP($A85,Dateneingabe!$D$11:$P$109,12,FALSE))","v":""}]
[{"$f":"IF('Liste Klasse S'!A13=\"\",\"\",'Liste Klasse S'!A13&\" / \"&'Liste Klasse S'!B13&\" / Klasse S\")","v":""},{"$f":"IF('Liste Klasse S'!C13=\"\",\"\",'Liste Klasse S'!C13)","v":""},{"$f":"IF('Liste Klasse S'!D13=\"\",\"\",'Liste Klasse S'!D13)","v":""},{"$f":"IF('Liste Klasse S'!E13=\"\",\"\",'Liste Klasse S'!E13)","v":""},{"$f":"IF('Liste Klasse S'!F13=\"\",\"\",'Liste Klasse S'!F13)","v":""},{"$f":"IF('Liste Klasse S'!G13=\"\",\"\",'Liste Klasse S'!G13)","v":""},{"$f":"IF($A86=\"\",\"\",VLOOKUP($A86,Dateneingabe!$D$11:$P$109,8,FALSE))","v":""},{"$f":"IF($A86=\"\",\"\",VLOOKUP($A86,Dateneingabe!$D$11:$P$109,11,FALSE))","v":""},null,{"$f":"IF($A86=\"\",\"\",VLOOKUP($A86,Dateneingabe!$D$11:$P$109,12,FALSE))","v":""}]
[{"$f":"IF('Liste Klasse S'!A14=\"\",\"\",'Liste Klasse S'!A14&\" / \"&'Liste Klasse S'!B14&\" / Klasse S\")","v":""},{"$f":"IF('Liste Klasse S'!C14=\"\",\"\",'Liste Klasse S'!C14)","v":""},{"$f":"IF('Liste Klasse S'!D14=\"\",\"\",'Liste Klasse S'!D14)","v":""},{"$f":"IF('Liste Klasse S'!E14=\"\",\"\",'Liste Klasse S'!E14)","v":""},{"$f":"IF('Liste Klasse S'!F14=\"\",\"\",'Liste Klasse S'!F14)","v":""},{"$f":"IF('Liste Klasse S'!G14=\"\",\"\",'Liste Klasse S'!G14)","v":""},{"$f":"IF($A87=\"\",\"\",VLOOKUP($A87,Dateneingabe!$D$11:$P$109,8,FALSE))","v":""},{"$f":"IF($A87=\"\",\"\",VLOOKUP($A87,Dateneingabe!$D$11:$P$109,11,FALSE))","v":""},null,{"$f":"IF($A87=\"\",\"\",VLOOKUP($A87,Dateneingabe!$D$11:$P$109,12,FALSE))","v":""}]
[{"$f":"IF('Liste Klasse S'!A15=\"\",\"\",'Liste Klasse S'!A15&\" / \"&'Liste Klasse S'!B15&\" / Klasse S\")","v":""},{"$f":"IF('Liste Klasse S'!C15=\"\",\"\",'Liste Klasse S'!C15)","v":""},{"$f":"IF('Liste Klasse S'!D15=\"\",\"\",'Liste Klasse S'!D15)","v":""},{"$f":"IF('Liste Klasse S'!E15=\"\",\"\",'Liste Klasse S'!E15)","v":""},{"$f":"IF('Liste Klasse S'!F15=\"\",\"\",'Liste Klasse S'!F15)","v":""},{"$f":"IF('Liste Klasse S'!G15=\"\",\"\",'Liste Klasse S'!G15)","v":""},{"$f":"IF($A88=\"\",\"\",VLOOKUP($A88,Dateneingabe!$D$11:$P$109,8,FALSE))","v":""},{"$f":"IF($A88=\"\",\"\",VLOOKUP($A88,Dateneingabe!$D$11:$P$109,11,FALSE))","v":""},null,{"$f":"IF($A88=\"\",\"\",VLOOKUP($A88,Dateneingabe!$D$11:$P$109,12,FALSE))","v":""}]
[{"$f":"IF('Liste Klasse S'!A16=\"\",\"\",'Liste Klasse S'!A16&\" / \"&'Liste Klasse S'!B16&\" / Klasse S\")","v":""},{"$f":"IF('Liste Klasse S'!C16=\"\",\"\",'Liste Klasse S'!C16)","v":""},{"$f":"IF('Liste Klasse S'!D16=\"\",\"\",'Liste Klasse S'!D16)","v":""},{"$f":"IF('Liste Klasse S'!E16=\"\",\"\",'Liste Klasse S'!E16)","v":""},{"$f":"IF('Liste Klasse S'!F16=\"\",\"\",'Liste Klasse S'!F16)","v":""},{"$f":"IF('Liste Klasse S'!G16=\"\",\"\",'Liste Klasse S'!G16)","v":""},{"$f":"IF($A89=\"\",\"\",VLOOKUP($A89,Dateneingabe!$D$11:$P$109,8,FALSE))","v":""},{"$f":"IF($A89=\"\",\"\",VLOOKUP($A89,Dateneingabe!$D$11:$P$109,11,FALSE))","v":""},null,{"$f":"IF($A89=\"\",\"\",VLOOKUP($A89,Dateneingabe!$D$11:$P$109,12,FALSE))","v":""}]
[{"$f":"IF('Liste Klasse S'!A17=\"\",\"\",'Liste Klasse S'!A17&\" / \"&'Liste Klasse S'!B17&\" / Klasse S\")","v":""},{"$f":"IF('Liste Klasse S'!C17=\"\",\"\",'Liste Klasse S'!C17)","v":""},{"$f":"IF('Liste Klasse S'!D17=\"\",\"\",'Liste Klasse S'!D17)","v":""},{"$f":"IF('Liste Klasse S'!E17=\"\",\"\",'Liste Klasse S'!E17)","v":""},{"$f":"IF('Liste Klasse S'!F17=\"\",\"\",'Liste Klasse S'!F17)","v":""},{"$f":"IF('Liste Klasse S'!G17=\"\",\"\",'Liste Klasse S'!G17)","v":""},{"$f":"IF($A90=\"\",\"\",VLOOKUP($A90,Dateneingabe!$D$11:$P$109,8,FALSE))","v":""},{"$f":"IF($A90=\"\",\"\",VLOOKUP($A90,Dateneingabe!$D$11:$P$109,11,FALSE))","v":""},null,{"$f":"IF($A90=\"\",\"\",VLOOKUP($A90,Dateneingabe!$D$11:$P$109,12,FALSE))","v":""}]
[{"$f":"IF('Liste Klasse S'!A18=\"\",\"\",'Liste Klasse S'!A18&\" / \"&'Liste Klasse S'!B18&\" / Klasse S\")","v":""},{"$f":"IF('Liste Klasse S'!C18=\"\",\"\",'Liste Klasse S'!C18)","v":""},{"$f":"IF('Liste Klasse S'!D18=\"\",\"\",'Liste Klasse S'!D18)","v":""},{"$f":"IF('Liste Klasse S'!E18=\"\",\"\",'Liste Klasse S'!E18)","v":""},{"$f":"IF('Liste Klasse S'!F18=\"\",\"\",'Liste Klasse S'!F18)","v":""},{"$f":"IF('Liste Klasse S'!G18=\"\",\"\",'Liste Klasse S'!G18)","v":""},{"$f":"IF($A91=\"\",\"\",VLOOKUP($A91,Dateneingabe!$D$11:$P$109,8,FALSE))","v":""},{"$f":"IF($A91=\"\",\"\",VLOOKUP($A91,Dateneingabe!$D$11:$P$109,11,FALSE))","v":""},null,{"$f":"IF($A91=\"\",\"\",VLOOKUP($A91,Dateneingabe!$D$11:$P$109,12,FALSE))","v":""}]
[{"$f":"IF('Liste Klasse S'!A19=\"\",\"\",'Liste Klasse S'!A19&\" / \"&'Liste Klasse S'!B19&\" / Klasse S\")","v":""},{"$f":"IF('Liste Klasse S'!C19=\"\",\"\",'Liste Klasse S'!C19)","v":""},{"$f":"IF('Liste Klasse S'!D19=\"\",\"\",'Liste Klasse S'!D19)","v":""},{"$f":"IF('Liste Klasse S'!E19=\"\",\"\",'Liste Klasse S'!E19)","v":""},{"$f":"IF('Liste Klasse S'!F19=\"\",\"\",'Liste Klasse S'!F19)","v":""},{"$f":"IF('Liste Klasse S'!G19=\"\",\"\",'Liste Klasse S'!G19)","v":""},{"$f":"IF($A92=\"\",\"\",VLOOKUP($A92,Dateneingabe!$D$11:$P$109,8,FALSE))","v":""},{"$f":"IF($A92=\"\",\"\",VLOOKUP($A92,Dateneingabe!$D$11:$P$109,11,FALSE))","v":""},null,{"$f":"IF($A92=\"\",\"\",VLOOKUP($A92,Dateneingabe!$D$11:$P$109,12,FALSE))","v":""}]
[{"$f":"IF('Liste Klasse S'!A20=\"\",\"\",'Liste Klasse S'!A20&\" / \"&'Liste Klasse S'!B20&\" / Klasse S\")","v":""},{"$f":"IF('Liste Klasse S'!C20=\"\",\"\",'Liste Klasse S'!C20)","v":""},{"$f":"IF('Liste Klasse S'!D20=\"\",\"\",'Liste Klasse S'!D20)","v":""},{"$f":"IF('Liste Klasse S'!E20=\"\",\"\",'Liste Klasse S'!E20)","v":""},{"$f":"IF('Liste Klasse S'!F20=\"\",\"\",'Liste Klasse S'!F20)","v":""},{"$f":"IF('Liste Klasse S'!G20=\"\",\"\",'Liste Klasse S'!G20)","v":""},{"$f":"IF($A93=\"\",\"\",VLOOKUP($A93,Dateneingabe!$D$11:$P$109,8,FALSE))","v":""},{"$f":"IF($A93=\"\",\"\",VLOOKUP($A93,Dateneingabe!$D$11:$P$109,11,FALSE))","v":""},null,{"$f":"IF($A93=\"\",\"\",VLOOKUP($A93,Dateneingabe!$D$11:$P$109,12,FALSE))","v":""}]
[{"$f":"IF('Liste Klasse S'!A21=\"\",\"\",'Liste Klasse S'!A21&\" / \"&'Liste Klasse S'!B21&\" / Klasse S\")","v":""},{"$f":"IF('Liste Klasse S'!C21=\"\",\"\",'Liste Klasse S'!C21)","v":""},{"$f":"IF('Liste Klasse S'!D21=\"\",\"\",'Liste Klasse S'!D21)","v":""},{"$f":"IF('Liste Klasse S'!E21=\"\",\"\",'Liste Klasse S'!E21)","v":""},{"$f":"IF('Liste Klasse S'!F21=\"\",\"\",'Liste Klasse S'!F21)","v":""},{"$f":"IF('Liste Klasse S'!G21=\"\",\"\",'Liste Klasse S'!G21)","v":""},{"$f":"IF($A94=\"\",\"\",VLOOKUP($A94,Dateneingabe!$D$11:$P$109,8,FALSE))","v":""},{"$f":"IF($A94=\"\",\"\",VLOOKUP($A94,Dateneingabe!$D$11:$P$109,11,FALSE))","v":""},null,{"$f":"IF($A94=\"\",\"\",VLOOKUP($A94,Dateneingabe!$D$11:$P$109,12,FALSE))","v":""}]
[{"$f":"IF('Liste Klasse S'!A22=\"\",\"\",'Liste Klasse S'!A22&\" / \"&'Liste Klasse S'!B22&\" / Klasse S\")","v":""},{"$f":"IF('Liste Klasse S'!C22=\"\",\"\",'Liste Klasse S'!C22)","v":""},{"$f":"IF('Liste Klasse S'!D22=\"\",\"\",'Liste Klasse S'!D22)","v":""},{"$f":"IF('Liste Klasse S'!E22=\"\",\"\",'Liste Klasse S'!E22)","v":""},{"$f":"IF('Liste Klasse S'!F22=\"\",\"\",'Liste Klasse S'!F22)","v":""},{"$f":"IF('Liste Klasse S'!G22=\"\",\"\",'Liste Klasse S'!G22)","v":""},{"$f":"IF($A95=\"\",\"\",VLOOKUP($A95,Dateneingabe!$D$11:$P$109,8,FALSE))","v":""},{"$f":"IF($A95=\"\",\"\",VLOOKUP($A95,Dateneingabe!$D$11:$P$109,11,FALSE))","v":""},null,{"$f":"IF($A95=\"\",\"\",VLOOKUP($A95,Dateneingabe!$D$11:$P$109,12,FALSE))","v":""}]
[{"$f":"IF('Liste Klasse S'!A23=\"\",\"\",'Liste Klasse S'!A23&\" / \"&'Liste Klasse S'!B23&\" / Klasse S\")","v":""},{"$f":"IF('Liste Klasse S'!C23=\"\",\"\",'Liste Klasse S'!C23)","v":""},{"$f":"IF('Liste Klasse S'!D23=\"\",\"\",'Liste Klasse S'!D23)","v":""},{"$f":"IF('Liste Klasse S'!E23=\"\",\"\",'Liste Klasse S'!E23)","v":""},{"$f":"IF('Liste Klasse S'!F23=\"\",\"\",'Liste Klasse S'!F23)","v":""},{"$f":"IF('Liste Klasse S'!G23=\"\",\"\",'Liste Klasse S'!G23)","v":""},{"$f":"IF($A96=\"\",\"\",VLOOKUP($A96,Dateneingabe!$D$11:$P$109,8,FALSE))","v":""},{"$f":"IF($A96=\"\",\"\",VLOOKUP($A96,Dateneingabe!$D$11:$P$109,11,FALSE))","v":""},null,{"$f":"IF($A96=\"\",\"\",VLOOKUP($A96,Dateneingabe!$D$11:$P$109,12,FALSE))","v":""}]
[{"$f":"IF('Liste Klasse S'!A24=\"\",\"\",'Liste Klasse S'!A24&\" / \"&'Liste Klasse S'!B24&\" / Klasse S\")","v":""},{"$f":"IF('Liste Klasse S'!C24=\"\",\"\",'Liste Klasse S'!C24)","v":""},{"$f":"IF('Liste Klasse S'!D24=\"\",\"\",'Liste Klasse S'!D24)","v":""},{"$f":"IF('Liste Klasse S'!E24=\"\",\"\",'Liste Klasse S'!E24)","v":""},{"$f":"IF('Liste Klasse S'!F24=\"\",\"\",'Liste Klasse S'!F24)","v":""},{"$f":"IF('Liste Klasse S'!G24=\"\",\"\",'Liste Klasse S'!G24)","v":""},{"$f":"IF($A97=\"\",\"\",VLOOKUP($A97,Dateneingabe!$D$11:$P$109,8,FALSE))","v":""},{"$f":"IF($A97=\"\",\"\",VLOOKUP($A97,Dateneingabe!$D$11:$P$109,11,FALSE))","v":""},null,{"$f":"IF($A97=\"\",\"\",VLOOKUP($A97,Dateneingabe!$D$11:$P$109,12,FALSE))","v":""}]
[{"$f":"IF('Liste Klasse S'!A25=\"\",\"\",'Liste Klasse S'!A25&\" / \"&'Liste Klasse S'!B25&\" / Klasse S\")","v":""},{"$f":"IF('Liste Klasse S'!C25=\"\",\"\",'Liste Klasse S'!C25)","v":""},{"$f":"IF('Liste Klasse S'!D25=\"\",\"\",'Liste Klasse S'!D25)","v":""},{"$f":"IF('Liste Klasse S'!E25=\"\",\"\",'Liste Klasse S'!E25)","v":""},{"$f":"IF('Liste Klasse S'!F25=\"\",\"\",'Liste Klasse S'!F25)","v":""},{"$f":"IF('Liste Klasse S'!G25=\"\",\"\",'Liste Klasse S'!G25)","v":""},{"$f":"IF($A98=\"\",\"\",VLOOKUP($A98,Dateneingabe!$D$11:$P$109,8,FALSE))","v":""},{"$f":"IF($A98=\"\",\"\",VLOOKUP($A98,Dateneingabe!$D$11:$P$109,11,FALSE))","v":""},null,{"$f":"IF($A98=\"\",\"\",VLOOKUP($A98,Dateneingabe!$D$11:$P$109,12,FALSE))","v":""}]

{"sheet":"Gesamtergebnisliste","index":12,"n_rows":98,"n_cols":20,"rows_kept":98,"cut":false,"hidden":false,"merged":[[0,13,0,19],[1,0,1,4],[1,5,1,15],[0,0,0,12],[1,17,1,19]]}
[{"$f":"\"HSVRM Obedience: \"&Dateneingabe!C6&\"\"","v":"HSVRM Obedience: <Titel der Veranstaltung - z. B. Obedience-Prüfung>"},null,null,null,null,null,null,null,null,null,null,null,null,"Gesamtergebnisliste"]
[{"$f":"\"Veranstalter: \"&Dateneingabe!C5","v":"Veranstalter: <Veranstaltender Verein oder Verband>"},null,null,null,null,{"$f":"\"LR: \"&Dateneingabe!I4","v":"LR: <Name der Leistungsrichter>"},null,null,null,null,null,null,null,null,null,null,"am:",{"$f":"Dateneingabe!C7","v":"<Prüfungstag/e>"}]
[{"$f":"'Hinweise - bitte beachten!!!'!A1:A1&\" - \"&'Hinweise - bitte beachten!!!'!A2:A2","v":"HSVRM Obedience Auswertung - Version 2019 v5.1 - erstellt von Sören Marquardt für den Hundesportverband Rhein-Main (HSVRM)"}]
["Start / Los / Klasse","Hundeführer/-in","Verein","Verband","Hund","Rasse",{"$f":"IF('Liste Beginner'!H$4=0,\"\",'Liste Beginner'!H$4)","v":1},{"$f":"IF('Liste Beginner'!I$4=0,\"\",'Liste Beginner'!I$4)","v":2},{"$f":"IF('Liste Beginner'!J$4=0,\"\",'Liste Beginner'!J$4)","v":3},{"$f":"IF('Liste Beginner'!K$4=0,\"\",'Liste Beginner'!K$4)","v":4},{"$f":"IF('Liste Beginner'!L$4=0,\"\",'Liste Beginner'!L$4)","v":5},{"$f":"IF('Liste Beginner'!M$4=0,\"\",'Liste Beginner'!M$4)","v":6},{"$f":"IF('Liste Beginner'!N$4=0,\"\",'Liste Beginner'!N$4)","v":7},{"$f":"IF('Liste Beginner'!O$4=0,\"\",'Liste Beginner'!O$4)","v":8},{"$f":"IF('Liste Beginner'!P$4=0,\"\",'Liste Beginner'!P$4)","v":9},{"$f":"IF('Liste Beginner'!Q$4=0,\"\",'Liste Beginner'!Q$4)","v":10},{"$f":"IF('Liste Beginner'!R$4=0,\"\",'Liste Beginner'!R$4)","v":11},"Gesamt","WN","Platz"]
[{"$f":"IF('Liste Beginner'!A8=\"\",\"\",'Liste Beginner'!A8&\" / \"&'Liste Beginner'!B8&\" / Beginner\")","v":""},{"$f":"IF('Liste Beginner'!C8=\"\",\"\",'Liste Beginner'!C8)","v":""},{"$f":"IF('Liste Beginner'!D8=\"\",\"\",'Liste Beginner'!D8)","v":""},{"$f":"IF('Liste Beginner'!E8=\"\",\"\",'Liste Beginner'!E8)","v":""},{"$f":"IF('Liste Beginner'!F8=\"\",\"\",'Liste Beginner'!F8)","v":""},{"$f":"IF('Liste Beginner'!G8=\"\",\"\",'Liste Beginner'!G8)","v":""},{"$f":"IF('Liste Beginner'!H8=\"\",\"\",'Liste Beginner'!H8)","v":""},{"$f":"IF('Liste Beginner'!I8=\"\",\"\",'Liste Beginner'!I8)","v":""},{"$f":"IF('Liste Beginner'!J8=\"\",\"\",'Liste Beginner'!J8)","v":""},{"$f":"IF('Liste Beginner'!K8=\"\",\"\",'Liste Beginner'!K8)","v":""},{"$f":"IF('Liste Beginner'!L8=\"\",\"\",'Liste Beginner'!L8)","v":""},{"$f":"IF('Liste Beginner'!M8=\"\",\"\",'Liste Beginner'!M8)","v":""},{"$f":"IF('Liste Beginner'!N8=\"\",\"\",'Liste Beginner'!N8)","v":""},{"$f":"IF('Liste Beginner'!O8=\"\",\"\",'Liste Beginner'!O8)","v":""},{"$f":"IF('Liste Beginner'!P8=\"\",\"\",'Liste Beginner'!P8)","v":""},{"$f":"IF('Liste Beginner'!Q8=\"\",\"\",'Liste Beginner'!Q8)","v":""},{"$f":"IF('Liste Beginner'!R8=\"\",\"\",'Liste Beginner'!R8)","v":""},{"$f":"'Liste Beginner'!S8","v":0},{"$f":"'Liste Beginner'!T8","v":""},{"$f":"'Liste Beginner'!U8","v":0}]
[{"$f":"IF('Liste Beginner'!A9=\"\",\"\",'Liste Beginner'!A9&\" / \"&'Liste Beginner'!B9&\" / Beginner\")","v":""},{"$f":"IF('Liste Beginner'!C9=\"\",\"\",'Liste Beginner'!C9)","v":""},{"$f":"IF('Liste Beginner'!D9=\"\",\"\",'Liste Beginner'!D9)","v":""},{"$f":"IF('Liste Beginner'!E9=\"\",\"\",'Liste Beginner'!E9)","v":""},{"$f":"IF('Liste Beginner'!F9=\"\",\"\",'Liste Beginner'!F9)","v":""},{"$f":"IF('Liste Beginner'!G9=\"\",\"\",'Liste Beginner'!G9)","v":""},{"$f":"IF('Liste Beginner'!H9=\"\",\"\",'Liste Beginner'!H9)","v":""},{"$f":"IF('Liste Beginner'!I9=\"\",\"\",'Liste Beginner'!I9)","v":""},{"$f":"IF('Liste Beginner'!J9=\"\",\"\",'Liste Beginner'!J9)","v":""},{"$f":"IF('Liste Beginner'!K9=\"\",\"\",'Liste Beginner'!K9)","v":""},{"$f":"IF('Liste Beginner'!L9=\"\",\"\",'Liste Beginner'!L9)","v":""},{"$f":"IF('Liste Beginner'!M9=\"\",\"\",'Liste Beginner'!M9)","v":""},{"$f":"IF('Liste Beginner'!N9=\"\",\"\",'Liste Beginner'!N9)","v":""},{"$f":"IF('Liste Beginner'!O9=\"\",\"\",'Liste Beginner'!O9)","v":""},{"$f":"IF('Liste Beginner'!P9=\"\",\"\",'Liste Beginner'!P9)","v":""},{"$f":"IF('Liste Beginner'!Q9=\"\",\"\",'Liste Beginner'!Q9)","v":""},{"$f":"IF('Liste Beginner'!R9=\"\",\"\",'Liste Beginner'!R9)","v":""},{"$f":"'Liste Beginner'!S9","v":0},{"$f":"'Liste Beginner'!T9","v":""},{"$f":"'Liste Beginner'!U9","v":0}]
[{"$f":"IF('Liste Beginner'!A10=\"\",\"\",'Liste Beginner'!A10&\" / \"&'Liste Beginner'!B10&\" / Beginner\")","v":""},{"$f":"IF('Liste Beginner'!C10=\"\",\"\",'Liste Beginner'!C10)","v":""},{"$f":"IF('Liste Beginner'!D10=\"\",\"\",'Liste Beginner'!D10)","v":""},{"$f":"IF('Liste Beginner'!E10=\"\",\"\",'Liste Beginner'!E10)","v":""},{"$f":"IF('Liste Beginner'!F10=\"\",\"\",'Liste Beginner'!F10)","v":""},{"$f":"IF('Liste Beginner'!G10=\"\",\"\",'Liste Beginner'!G10)","v":""},{"$f":"IF('Liste Beginner'!H10=\"\",\"\",'Liste Beginner'!H10)","v":""},{"$f":"IF('Liste Beginner'!I10=\"\",\"\",'Liste Beginner'!I10)","v":""},{"$f":"IF('Liste Beginner'!J10=\"\",\"\",'Liste Beginner'!J10)","v":""},{"$f":"IF('Liste Beginner'!K10=\"\",\"\",'Liste Beginner'!K10)","v":""},{"$f":"IF('Liste Beginner'!L10=\"\",\"\",'Liste Beginner'!L10)","v":""},{"$f":"IF('Liste Beginner'!M10=\"\",\"\",'Liste Beginner'!M10)","v":""},{"$f":"IF('Liste Beginner'!N10=\"\",\"\",'Liste Beginner'!N10)","v":""},{"$f":"IF('Liste Beginner'!O10=\"\",\"\",'Liste Beginner'!O10)","v":""},{"$f":"IF('Liste Beginner'!P10=\"\",\"\",'Liste Beginner'!P10)","v":""},{"$f":"IF('Liste Beginner'!Q10=\"\",\"\",'Liste Beginner'!Q10)","v":""},{"$f":"IF('Liste Beginner'!R10=\"\",\"\",'Liste Beginner'!R10)","v":""},{"$f":"'Liste Beginner'!S10","v":0},{"$f":"'Liste Beginner'!T10","v":""},{"$f":"'Liste Beginner'!U10","v":0}]
[{"$f":"IF('Liste Beginner'!A11=\"\",\"\",'Liste Beginner'!A11&\" / \"&'Liste Beginner'!B11&\" / Beginner\")","v":""},{"$f":"IF('Liste Beginner'!C11=\"\",\"\",'Liste Beginner'!C11)","v":""},{"$f":"IF('Liste Beginner'!D11=\"\",\"\",'Liste Beginner'!D11)","v":""},{"$f":"IF('Liste Beginner'!E11=\"\",\"\",'Liste Beginner'!E11)","v":""},{"$f":"IF('Liste Beginner'!F11=\"\",\"\",'Liste Beginner'!F11)","v":""},{"$f":"IF('Liste Beginner'!G11=\"\",\"\",'Liste Beginner'!G11)","v":""},{"$f":"IF('Liste Beginner'!H11=\"\",\"\",'Liste Beginner'!H11)","v":""},{"$f":"IF('Liste Beginner'!I11=\"\",\"\",'Liste Beginner'!I11)","v":""},{"$f":"IF('Liste Beginner'!J11=\"\",\"\",'Liste Beginner'!J11)","v":""},{"$f":"IF('Liste Beginner'!K11=\"\",\"\",'Liste Beginner'!K11)","v":""},{"$f":"IF('Liste Beginner'!L11=\"\",\"\",'Liste Beginner'!L11)","v":""},{"$f":"IF('Liste Beginner'!M11=\"\",\"\",'Liste Beginner'!M11)","v":""},{"$f":"IF('Liste Beginner'!N11=\"\",\"\",'Liste Beginner'!N11)","v":""},{"$f":"IF('Liste Beginner'!O11=\"\",\"\",'Liste Beginner'!O11)","v":""},{"$f":"IF('Liste Beginner'!P11=\"\",\"\",'Liste Beginner'!P11)","v":""},{"$f":"IF('Liste Beginner'!Q11=\"\",\"\",'Liste Beginner'!Q11)","v":""},{"$f":"IF('Liste Beginner'!R11=\"\",\"\",'Liste Beginner'!R11)","v":""},{"$f":"'Liste Beginner'!S11","v":0},{"$f":"'Liste Beginner'!T11","v":""},{"$f":"'Liste Beginner'!U11","v":0}]
[{"$f":"IF('Liste Beginner'!A12=\"\",\"\",'Liste Beginner'!A12&\" / \"&'Liste Beginner'!B12&\" / Beginner\")","v":""},{"$f":"IF('Liste Beginner'!C12=\"\",\"\",'Liste Beginner'!C12)","v":""},{"$f":"IF('Liste Beginner'!D12=\"\",\"\",'Liste Beginner'!D12)","v":""},{"$f":"IF('Liste Beginner'!E12=\"\",\"\",'Liste Beginner'!E12)","v":""},{"$f":"IF('Liste Beginner'!F12=\"\",\"\",'Liste Beginner'!F12)","v":""},{"$f":"IF('Liste Beginner'!G12=\"\",\"\",'Liste Beginner'!G12)","v":""},{"$f":"IF('Liste Beginner'!H12=\"\",\"\",'Liste Beginner'!H12)","v":""},{"$f":"IF('Liste Beginner'!I12=\"\",\"\",'Liste Beginner'!I12)","v":""},{"$f":"IF('Liste Beginner'!J12=\"\",\"\",'Liste Beginner'!J12)","v":""},{"$f":"IF('Liste Beginner'!K12=\"\",\"\",'Liste Beginner'!K12)","v":""},{"$f":"IF('Liste Beginner'!L12=\"\",\"\",'Liste Beginner'!L12)","v":""},{"$f":"IF('Liste Beginner'!M12=\"\",\"\",'Liste Beginner'!M12)","v":""},{"$f":"IF('Liste Beginner'!N12=\"\",\"\",'Liste Beginner'!N12)","v":""},{"$f":"IF('Liste Beginner'!O12=\"\",\"\",'Liste Beginner'!O12)","v":""},{"$f":"IF('Liste Beginner'!P12=\"\",\"\",'Liste Beginner'!P12)","v":""},{"$f":"IF('Liste Beginner'!Q12=\"\",\"\",'Liste Beginner'!Q12)","v":""},{"$f":"IF('Liste Beginner'!R12=\"\",\"\",'Liste Beginner'!R12)","v":""},{"$f":"'Liste Beginner'!S12","v":0},{"$f":"'Liste Beginner'!T12","v":""},{"$f":"'Liste Beginner'!U12","v":0}]
[{"$f":"IF('Liste Beginner'!A13=\"\",\"\",'Liste Beginner'!A13&\" / \"&'Liste Beginner'!B13&\" / Beginner\")","v":""},{"$f":"IF('Liste Beginner'!C13=\"\",\"\",'Liste Beginner'!C13)","v":""},{"$f":"IF('Liste Beginner'!D13=\"\",\"\",'Liste Beginner'!D13)","v":""},{"$f":"IF('Liste Beginner'!E13=\"\",\"\",'Liste Beginner'!E13)","v":""},{"$f":"IF('Liste Beginner'!F13=\"\",\"\",'Liste Beginner'!F13)","v":""},{"$f":"IF('Liste Beginner'!G13=\"\",\"\",'Liste Beginner'!G13)","v":""},{"$f":"IF('Liste Beginner'!H13=\"\",\"\",'Liste Beginner'!H13)","v":""},{"$f":"IF('Liste Beginner'!I13=\"\",\"\",'Liste Beginner'!I13)","v":""},{"$f":"IF('Liste Beginner'!J13=\"\",\"\",'Liste Beginner'!J13)","v":""},{"$f":"IF('Liste Beginner'!K13=\"\",\"\",'Liste Beginner'!K13)","v":""},{"$f":"IF('Liste Beginner'!L13=\"\",\"\",'Liste Beginner'!L13)","v":""},{"$f":"IF('Liste Beginner'!M13=\"\",\"\",'Liste Beginner'!M13)","v":""},{"$f":"IF('Liste Beginner'!N13=\"\",\"\",'Liste Beginner'!N13)","v":""},{"$f":"IF('Liste Beginner'!O13=\"\",\"\",'Liste Beginner'!O13)","v":""},{"$f":"IF('Liste Beginner'!P13=\"\",\"\",'Liste Beginner'!P13)","v":""},{"$f":"IF('Liste Beginner'!Q13=\"\",\"\",'Liste Beginner'!Q13)","v":""},{"$f":"IF('Liste Beginner'!R13=\"\",\"\",'Liste Beginner'!R13)","v":""},{"$f":"'Liste Beginner'!S13","v":0},{"$f":"'Liste Beginner'!T13","v":""},{"$f":"'Liste Beginner'!U13","v":0}]
[{"$f":"IF('Liste Beginner'!A14=\"\",\"\",'Liste Beginner'!A14&\" / \"&'Liste Beginner'!B14&\" / Beginner\")","v":""},{"$f":"IF('Liste Beginner'!C14=\"\",\"\",'Liste Beginner'!C14)","v":""},{"$f":"IF('Liste Beginner'!D14=\"\",\"\",'Liste Beginner'!D14)","v":""},{"$f":"IF('Liste Beginner'!E14=\"\",\"\",'Liste Beginner'!E14)","v":""},{"$f":"IF('Liste Beginner'!F14=\"\",\"\",'Liste Beginner'!F14)","v":""},{"$f":"IF('Liste Beginner'!G14=\"\",\"\",'Liste Beginner'!G14)","v":""},{"$f":"IF('Liste Beginner'!H14=\"\",\"\",'Liste Beginner'!H14)","v":""},{"$f":"IF('Liste Beginner'!I14=\"\",\"\",'Liste Beginner'!I14)","v":""},{"$f":"IF('Liste Beginner'!J14=\"\",\"\",'Liste Beginner'!J14)","v":""},{"$f":"IF('Liste Beginner'!K14=\"\",\"\",'Liste Beginner'!K14)","v":""},{"$f":"IF('Liste Beginner'!L14=\"\",\"\",'Liste Beginner'!L14)","v":""},{"$f":"IF('Liste Beginner'!M14=\"\",\"\",'Liste Beginner'!M14)","v":""},{"$f":"IF('Liste Beginner'!N14=\"\",\"\",'Liste Beginner'!N14)","v":""},{"$f":"IF('Liste Beginner'!O14=\"\",\"\",'Liste Beginner'!O14)","v":""},{"$f":"IF('Liste Beginner'!P14=\"\",\"\",'Liste Beginner'!P14)","v":""},{"$f":"IF('Liste Beginner'!Q14=\"\",\"\",'Liste Beginner'!Q14)","v":""},{"$f":"IF('Liste Beginner'!R14=\"\",\"\",'Liste Beginner'!R14)","v":""},{"$f":"'Liste Beginner'!S14","v":0},{"$f":"'Liste Beginner'!T14","v":""},{"$f":"'Liste Beginner'!U14","v":0}]
[{"$f":"IF('Liste Beginner'!A15=\"\",\"\",'Liste Beginner'!A15&\" / \"&'Liste Beginner'!B15&\" / Beginner\")","v":""},{"$f":"IF('Liste Beginner'!C15=\"\",\"\",'Liste Beginner'!C15)","v":""},{"$f":"IF('Liste Beginner'!D15=\"\",\"\",'Liste Beginner'!D15)","v":""},{"$f":"IF('Liste Beginner'!E15=\"\",\"\",'Liste Beginner'!E15)","v":""},{"$f":"IF('Liste Beginner'!F15=\"\",\"\",'Liste Beginner'!F15)","v":""},{"$f":"IF('Liste Beginner'!G15=\"\",\"\",'Liste Beginner'!G15)","v":""},{"$f":"IF('Liste Beginner'!H15=\"\",\"\",'Liste Beginner'!H15)","v":""},{"$f":"IF('Liste Beginner'!I15=\"\",\"\",'Liste Beginner'!I15)","v":""},{"$f":"IF('Liste Beginner'!J15=\"\",\"\",'Liste Beginner'!J15)","v":""},{"$f":"IF('Liste Beginner'!K15=\"\",\"\",'Liste Beginner'!K15)","v":""},{"$f":"IF('Liste Beginner'!L15=\"\",\"\",'Liste Beginner'!L15)","v":""},{"$f":"IF('Liste Beginner'!M15=\"\",\"\",'Liste Beginner'!M15)","v":""},{"$f":"IF('Liste Beginner'!N15=\"\",\"\",'Liste Beginner'!N15)","v":""},{"$f":"IF('Liste Beginner'!O15=\"\",\"\",'Liste Beginner'!O15)","v":""},{"$f":"IF('Liste Beginner'!P15=\"\",\"\",'Liste Beginner'!P15)","v":""},{"$f":"IF('Liste Beginner'!Q15=\"\",\"\",'Liste Beginner'!Q15)","v":""},{"$f":"IF('Liste Beginner'!R15=\"\",\"\",'Liste Beginner'!R15)","v":""},{"$f":"'Liste Beginner'!S15","v":0},{"$f":"'Liste Beginner'!T15","v":""},{"$f":"'Liste Beginner'!U15","v":0}]
[{"$f":"IF('Liste Beginner'!A16=\"\",\"\",'Liste Beginner'!A16&\" / \"&'Liste Beginner'!B16&\" / Beginner\")","v":""},{"$f":"IF('Liste Beginner'!C16=\"\",\"\",'Liste Beginner'!C16)","v":""},{"$f":"IF('Liste Beginner'!D16=\"\",\"\",'Liste Beginner'!D16)","v":""},{"$f":"IF('Liste Beginner'!E16=\"\",\"\",'Liste Beginner'!E16)","v":""},{"$f":"IF('Liste Beginner'!F16=\"\",\"\",'Liste Beginner'!F16)","v":""},{"$f":"IF('Liste Beginner'!G16=\"\",\"\",'Liste Beginner'!G16)","v":""},{"$f":"IF('Liste Beginner'!H16=\"\",\"\",'Liste Beginner'!H16)","v":""},{"$f":"IF('Liste Beginner'!I16=\"\",\"\",'Liste Beginner'!I16)","v":""},{"$f":"IF('Liste Beginner'!J16=\"\",\"\",'Liste Beginner'!J16)","v":""},{"$f":"IF('Liste Beginner'!K16=\"\",\"\",'Liste Beginner'!K16)","v":""},{"$f":"IF('Liste Beginner'!L16=\"\",\"\",'Liste Beginner'!L16)","v":""},{"$f":"IF('Liste Beginner'!M16=\"\",\"\",'Liste Beginner'!M16)","v":""},{"$f":"IF('Liste Beginner'!N16=\"\",\"\",'Liste Beginner'!N16)","v":""},{"$f":"IF('Liste Beginner'!O16=\"\",\"\",'Liste Beginner'!O16)","v":""},{"$f":"IF('Liste Beginner'!P16=\"\",\"\",'Liste Beginner'!P16)","v":""},{"$f":"IF('Liste Beginner'!Q16=\"\",\"\",'Liste Beginner'!Q16)","v":""},{"$f":"IF('Liste Beginner'!R16=\"\",\"\",'Liste Beginner'!R16)","v":""},{"$f":"'Liste Beginner'!S16","v":0},{"$f":"'Liste Beginner'!T16","v":""},{"$f":"'Liste Beginner'!U16","v":0}]
[{"$f":"IF('Liste Beginner'!A17=\"\",\"\",'Liste Beginner'!A17&\" / \"&'Liste Beginner'!B17&\" / Beginner\")","v":""},{"$f":"IF('Liste Beginner'!C17=\"\",\"\",'Liste Beginner'!C17)","v":""},{"$f":"IF('Liste Beginner'!D17=\"\",\"\",'Liste Beginner'!D17)","v":""},{"$f":"IF('Liste Beginner'!E17=\"\",\"\",'Liste Beginner'!E17)","v":""},{"$f":"IF('Liste Beginner'!F17=\"\",\"\",'Liste Beginner'!F17)","v":""},{"$f":"IF('Liste Beginner'!G17=\"\",\"\",'Liste Beginner'!G17)","v":""},{"$f":"IF('Liste Beginner'!H17=\"\",\"\",'Liste Beginner'!H17)","v":""},{"$f":"IF('Liste Beginner'!I17=\"\",\"\",'Liste Beginner'!I17)","v":""},{"$f":"IF('Liste Beginner'!J17=\"\",\"\",'Liste Beginner'!J17)","v":""},{"$f":"IF('Liste Beginner'!K17=\"\",\"\",'Liste Beginner'!K17)","v":""},{"$f":"IF('Liste Beginner'!L17=\"\",\"\",'Liste Beginner'!L17)","v":""},{"$f":"IF('Liste Beginner'!M17=\"\",\"\",'Liste Beginner'!M17)","v":""},{"$f":"IF('Liste Beginner'!N17=\"\",\"\",'Liste Beginner'!N17)","v":""},{"$f":"IF('Liste Beginner'!O17=\"\",\"\",'Liste Beginner'!O17)","v":""},{"$f":"IF('Liste Beginner'!P17=\"\",\"\",'Liste Beginner'!P17)","v":""},{"$f":"IF('Liste Beginner'!Q17=\"\",\"\",'Liste Beginner'!Q17)","v":""},{"$f":"IF('Liste Beginner'!R17=\"\",\"\",'Liste Beginner'!R17)","v":""},{"$f":"'Liste Beginner'!S17","v":0},{"$f":"'Liste Beginner'!T17","v":""},{"$f":"'Liste Beginner'!U17","v":0}]
[{"$f":"IF('Liste Beginner'!A18=\"\",\"\",'Liste Beginner'!A18&\" / \"&'Liste Beginner'!B18&\" / Beginner\")","v":""},{"$f":"IF('Liste Beginner'!C18=\"\",\"\",'Liste Beginner'!C18)","v":""},{"$f":"IF('Liste Beginner'!D18=\"\",\"\",'Liste Beginner'!D18)","v":""},{"$f":"IF('Liste Beginner'!E18=\"\",\"\",'Liste Beginner'!E18)","v":""},{"$f":"IF('Liste Beginner'!F18=\"\",\"\",'Liste Beginner'!F18)","v":""},{"$f":"IF('Liste Beginner'!G18=\"\",\"\",'Liste Beginner'!G18)","v":""},{"$f":"IF('Liste Beginner'!H18=\"\",\"\",'Liste Beginner'!H18)","v":""},{"$f":"IF('Liste Beginner'!I18=\"\",\"\",'Liste Beginner'!I18)","v":""},{"$f":"IF('Liste Beginner'!J18=\"\",\"\",'Liste Beginner'!J18)","v":""},{"$f":"IF('Liste Beginner'!K18=\"\",\"\",'Liste Beginner'!K18)","v":""},{"$f":"IF('Liste Beginner'!L18=\"\",\"\",'Liste Beginner'!L18)","v":""},{"$f":"IF('Liste Beginner'!M18=\"\",\"\",'Liste Beginner'!M18)","v":""},{"$f":"IF('Liste Beginner'!N18=\"\",\"\",'Liste Beginner'!N18)","v":""},{"$f":"IF('Liste Beginner'!O18=\"\",\"\",'Liste Beginner'!O18)","v":""},{"$f":"IF('Liste Beginner'!P18=\"\",\"\",'Liste Beginner'!P18)","v":""},{"$f":"IF('Liste Beginner'!Q18=\"\",\"\",'Liste Beginner'!Q18)","v":""},{"$f":"IF('Liste Beginner'!R18=\"\",\"\",'Liste Beginner'!R18)","v":""},{"$f":"'Liste Beginner'!S18","v":0},{"$f":"'Liste Beginner'!T18","v":""},{"$f":"'Liste Beginner'!U18","v":0}]
[{"$f":"IF('Liste Beginner'!A19=\"\",\"\",'Liste Beginner'!A19&\" / \"&'Liste Beginner'!B19&\" / Beginner\")","v":""},{"$f":"IF('Liste Beginner'!C19=\"\",\"\",'Liste Beginner'!C19)","v":""},{"$f":"IF('Liste Beginner'!D19=\"\",\"\",'Liste Beginner'!D19)","v":""},{"$f":"IF('Liste Beginner'!E19=\"\",\"\",'Liste Beginner'!E19)","v":""},{"$f":"IF('Liste Beginner'!F19=\"\",\"\",'Liste Beginner'!F19)","v":""},{"$f":"IF('Liste Beginner'!G19=\"\",\"\",'Liste Beginner'!G19)","v":""},{"$f":"IF('Liste Beginner'!H19=\"\",\"\",'Liste Beginner'!H19)","v":""},{"$f":"IF('Liste Beginner'!I19=\"\",\"\",'Liste Beginner'!I19)","v":""},{"$f":"IF('Liste Beginner'!J19=\"\",\"\",'Liste Beginner'!J19)","v":""},{"$f":"IF('Liste Beginner'!K19=\"\",\"\",'Liste Beginner'!K19)","v":""},{"$f":"IF('Liste Beginner'!L19=\"\",\"\",'Liste Beginner'!L19)","v":""},{"$f":"IF('Liste Beginner'!M19=\"\",\"\",'Liste Beginner'!M19)","v":""},{"$f":"IF('Liste Beginner'!N19=\"\",\"\",'Liste Beginner'!N19)","v":""},{"$f":"IF('Liste Beginner'!O19=\"\",\"\",'Liste Beginner'!O19)","v":""},{"$f":"IF('Liste Beginner'!P19=\"\",\"\",'Liste Beginner'!P19)","v":""},{"$f":"IF('Liste Beginner'!Q19=\"\",\"\",'Liste Beginner'!Q19)","v":""},{"$f":"IF('Liste Beginner'!R19=\"\",\"\",'Liste Beginner'!R19)","v":""},{"$f":"'Liste Beginner'!S19","v":0},{"$f":"'Liste Beginner'!T19","v":""},{"$f":"'Liste Beginner'!U19","v":0}]
[{"$f":"IF('Liste Beginner'!A20=\"\",\"\",'Liste Beginner'!A20&\" / \"&'Liste Beginner'!B20&\" / Beginner\")","v":""},{"$f":"IF('Liste Beginner'!C20=\"\",\"\",'Liste Beginner'!C20)","v":""},{"$f":"IF('Liste Beginner'!D20=\"\",\"\",'Liste Beginner'!D20)","v":""},{"$f":"IF('Liste Beginner'!E20=\"\",\"\",'Liste Beginner'!E20)","v":""},{"$f":"IF('Liste Beginner'!F20=\"\",\"\",'Liste Beginner'!F20)","v":""},{"$f":"IF('Liste Beginner'!G20=\"\",\"\",'Liste Beginner'!G20)","v":""},{"$f":"IF('Liste Beginner'!H20=\"\",\"\",'Liste Beginner'!H20)","v":""},{"$f":"IF('Liste Beginner'!I20=\"\",\"\",'Liste Beginner'!I20)","v":""},{"$f":"IF('Liste Beginner'!J20=\"\",\"\",'Liste Beginner'!J20)","v":""},{"$f":"IF('Liste Beginner'!K20=\"\",\"\",'Liste Beginner'!K20)","v":""},{"$f":"IF('Liste Beginner'!L20=\"\",\"\",'Liste Beginner'!L20)","v":""},{"$f":"IF('Liste Beginner'!M20=\"\",\"\",'Liste Beginner'!M20)","v":""},{"$f":"IF('Liste Beginner'!N20=\"\",\"\",'Liste Beginner'!N20)","v":""},{"$f":"IF('Liste Beginner'!O20=\"\",\"\",'Liste Beginner'!O20)","v":""},{"$f":"IF('Liste Beginner'!P20=\"\",\"\",'Liste Beginner'!P20)","v":""},{"$f":"IF('Liste Beginner'!Q20=\"\",\"\",'Liste Beginner'!Q20)","v":""},{"$f":"IF('Liste Beginner'!R20=\"\",\"\",'Liste Beginner'!R20)","v":""},{"$f":"'Liste Beginner'!S20","v":0},{"$f":"'Liste Beginner'!T20","v":""},{"$f":"'Liste Beginner'!U20","v":0}]
[{"$f":"IF('Liste Beginner'!A21=\"\",\"\",'Liste Beginner'!A21&\" / \"&'Liste Beginner'!B21&\" / Beginner\")","v":""},{"$f":"IF('Liste Beginner'!C21=\"\",\"\",'Liste Beginner'!C21)","v":""},{"$f":"IF('Liste Beginner'!D21=\"\",\"\",'Liste Beginner'!D21)","v":""},{"$f":"IF('Liste Beginner'!E21=\"\",\"\",'Liste Beginner'!E21)","v":""},{"$f":"IF('Liste Beginner'!F21=\"\",\"\",'Liste Beginner'!F21)","v":""},{"$f":"IF('Liste Beginner'!G21=\"\",\"\",'Liste Beginner'!G21)","v":""},{"$f":"IF('Liste Beginner'!H21=\"\",\"\",'Liste Beginner'!H21)","v":""},{"$f":"IF('Liste Beginner'!I21=\"\",\"\",'Liste Beginner'!I21)","v":""},{"$f":"IF('Liste Beginner'!J21=\"\",\"\",'Liste Beginner'!J21)","v":""},{"$f":"IF('Liste Beginner'!K21=\"\",\"\",'Liste Beginner'!K21)","v":""},{"$f":"IF('Liste Beginner'!L21=\"\",\"\",'Liste Beginner'!L21)","v":""},{"$f":"IF('Liste Beginner'!M21=\"\",\"\",'Liste Beginner'!M21)","v":""},{"$f":"IF('Liste Beginner'!N21=\"\",\"\",'Liste Beginner'!N21)","v":""},{"$f":"IF('Liste Beginner'!O21=\"\",\"\",'Liste Beginner'!O21)","v":""},{"$f":"IF('Liste Beginner'!P21=\"\",\"\",'Liste Beginner'!P21)","v":""},{"$f":"IF('Liste Beginner'!Q21=\"\",\"\",'Liste Beginner'!Q21)","v":""},{"$f":"IF('Liste Beginner'!R21=\"\",\"\",'Liste Beginner'!R21)","v":""},{"$f":"'Liste Beginner'!S21","v":0},{"$f":"'Liste Beginner'!T21","v":""},{"$f":"'Liste Beginner'!U21","v":0}]
[{"$f":"IF('Liste Beginner'!A22=\"\",\"\",'Liste Beginner'!A22&\" / \"&'Liste Beginner'!B22&\" / Beginner\")","v":""},{"$f":"IF('Liste Beginner'!C22=\"\",\"\",'Liste Beginner'!C22)","v":""},{"$f":"IF('Liste Beginner'!D22=\"\",\"\",'Liste Beginner'!D22)","v":""},{"$f":"IF('Liste Beginner'!E22=\"\",\"\",'Liste Beginner'!E22)","v":""},{"$f":"IF('Liste Beginner'!F22=\"\",\"\",'Liste Beginner'!F22)","v":""},{"$f":"IF('Liste Beginner'!G22=\"\",\"\",'Liste Beginner'!G22)","v":""},{"$f":"IF('Liste Beginner'!H22=\"\",\"\",'Liste Beginner'!H22)","v":""},{"$f":"IF('Liste Beginner'!I22=\"\",\"\",'Liste Beginner'!I22)","v":""},{"$f":"IF('Liste Beginner'!J22=\"\",\"\",'Liste Beginner'!J22)","v":""},{"$f":"IF('Liste Beginner'!K22=\"\",\"\",'Liste Beginner'!K22)","v":""},{"$f":"IF('Liste Beginner'!L22=\"\",\"\",'Liste Beginner'!L22)","v":""},{"$f":"IF('Liste Beginner'!M22=\"\",\"\",'Liste Beginner'!M22)","v":""},{"$f":"IF('Liste Beginner'!N22=\"\",\"\",'Liste Beginner'!N22)","v":""},{"$f":"IF('Liste Beginner'!O22=\"\",\"\",'Liste Beginner'!O22)","v":""},{"$f":"IF('Liste Beginner'!P22=\"\",\"\",'Liste Beginner'!P22)","v":""},{"$f":"IF('Liste Beginner'!Q22=\"\",\"\",'Liste Beginner'!Q22)","v":""},{"$f":"IF('Liste Beginner'!R22=\"\",\"\",'Liste Beginner'!R22)","v":""},{"$f":"'Liste Beginner'!S22","v":0},{"$f":"'Liste Beginner'!T22","v":""},{"$f":"'Liste Beginner'!U22","v":0}]
[{"$f":"IF('Liste Beginner'!A23=\"\",\"\",'Liste Beginner'!A23&\" / \"&'Liste Beginner'!B23&\" / Beginner\")","v":""},{"$f":"IF('Liste Beginner'!C23=\"\",\"\",'Liste Beginner'!C23)","v":""},{"$f":"IF('Liste Beginner'!D23=\"\",\"\",'Liste Beginner'!D23)","v":""},{"$f":"IF('Liste Beginner'!E23=\"\",\"\",'Liste Beginner'!E23)","v":""},{"$f":"IF('Liste Beginner'!F23=\"\",\"\",'Liste Beginner'!F23)","v":""},{"$f":"IF('Liste Beginner'!G23=\"\",\"\",'Liste Beginner'!G23)","v":""},{"$f":"IF('Liste Beginner'!H23=\"\",\"\",'Liste Beginner'!H23)","v":""},{"$f":"IF('Liste Beginner'!I23=\"\",\"\",'Liste Beginner'!I23)","v":""},{"$f":"IF('Liste Beginner'!J23=\"\",\"\",'Liste Beginner'!J23)","v":""},{"$f":"IF('Liste Beginner'!K23=\"\",\"\",'Liste Beginner'!K23)","v":""},{"$f":"IF('Liste Beginner'!L23=\"\",\"\",'Liste Beginner'!L23)","v":""},{"$f":"IF('Liste Beginner'!M23=\"\",\"\",'Liste Beginner'!M23)","v":""},{"$f":"IF('Liste Beginner'!N23=\"\",\"\",'Liste Beginner'!N23)","v":""},{"$f":"IF('Liste Beginner'!O23=\"\",\"\",'Liste Beginner'!O23)","v":""},{"$f":"IF('Liste Beginner'!P23=\"\",\"\",'Liste Beginner'!P23)","v":""},{"$f":"IF('Liste Beginner'!Q23=\"\",\"\",'Liste Beginner'!Q23)","v":""},{"$f":"IF('Liste Beginner'!R23=\"\",\"\",'Liste Beginner'!R23)","v":""},{"$f":"'Liste Beginner'!S23","v":0},{"$f":"'Liste Beginner'!T23","v":""},{"$f":"'Liste Beginner'!U23","v":0}]
[{"$f":"IF('Liste Beginner'!A24=\"\",\"\",'Liste Beginner'!A24&\" / \"&'Liste Beginner'!B24&\" / Beginner\")","v":""},{"$f":"IF('Liste Beginner'!C24=\"\",\"\",'Liste Beginner'!C24)","v":""},{"$f":"IF('Liste Beginner'!D24=\"\",\"\",'Liste Beginner'!D24)","v":""},{"$f":"IF('Liste Beginner'!E24=\"\",\"\",'Liste Beginner'!E24)","v":""},{"$f":"IF('Liste Beginner'!F24=\"\",\"\",'Liste Beginner'!F24)","v":""},{"$f":"IF('Liste Beginner'!G24=\"\",\"\",'Liste Beginner'!G24)","v":""},{"$f":"IF('Liste Beginner'!H24=\"\",\"\",'Liste Beginner'!H24)","v":""},{"$f":"IF('Liste Beginner'!I24=\"\",\"\",'Liste Beginner'!I24)","v":""},{"$f":"IF('Liste Beginner'!J24=\"\",\"\",'Liste Beginner'!J24)","v":""},{"$f":"IF('Liste Beginner'!K24=\"\",\"\",'Liste Beginner'!K24)","v":""},{"$f":"IF('Liste Beginner'!L24=\"\",\"\",'Liste Beginner'!L24)","v":""},{"$f":"IF('Liste Beginner'!M24=\"\",\"\",'Liste Beginner'!M24)","v":""},{"$f":"IF('Liste Beginner'!N24=\"\",\"\",'Liste Beginner'!N24)","v":""},{"$f":"IF('Liste Beginner'!O24=\"\",\"\",'Liste Beginner'!O24)","v":""},{"$f":"IF('Liste Beginner'!P24=\"\",\"\",'Liste Beginner'!P24)","v":""},{"$f":"IF('Liste Beginner'!Q24=\"\",\"\",'Liste Beginner'!Q24)","v":""},{"$f":"IF('Liste Beginner'!R24=\"\",\"\",'Liste Beginner'!R24)","v":""},{"$f":"'Liste Beginner'!S24","v":0},{"$f":"'Liste Beginner'!T24","v":""},{"$f":"'Liste Beginner'!U24","v":0}]
[{"$f":"IF('Liste Beginner'!A25=\"\",\"\",'Liste Beginner'!A25&\" / \"&'Liste Beginner'!B25&\" / Beginner\")","v":""},{"$f":"IF('Liste Beginner'!C25=\"\",\"\",'Liste Beginner'!C25)","v":""},{"$f":"IF('Liste Beginner'!D25=\"\",\"\",'Liste Beginner'!D25)","v":""},{"$f":"IF('Liste Beginner'!E25=\"\",\"\",'Liste Beginner'!E25)","v":""},{"$f":"IF('Liste Beginner'!F25=\"\",\"\",'Liste Beginner'!F25)","v":""},{"$f":"IF('Liste Beginner'!G25=\"\",\"\",'Liste Beginner'!G25)","v":""},{"$f":"IF('Liste Beginner'!H25=\"\",\"\",'Liste Beginner'!H25)","v":""},{"$f":"IF('Liste Beginner'!I25=\"\",\"\",'Liste Beginner'!I25)","v":""},{"$f":"IF('Liste Beginner'!J25=\"\",\"\",'Liste Beginner'!J25)","v":""},{"$f":"IF('Liste Beginner'!K25=\"\",\"\",'Liste Beginner'!K25)","v":""},{"$f":"IF('Liste Beginner'!L25=\"\",\"\",'Liste Beginner'!L25)","v":""},{"$f":"IF('Liste Beginner'!M25=\"\",\"\",'Liste Beginner'!M25)","v":""},{"$f":"IF('Liste Beginner'!N25=\"\",\"\",'Liste Beginner'!N25)","v":""},{"$f":"IF('Liste Beginner'!O25=\"\",\"\",'Liste Beginner'!O25)","v":""},{"$f":"IF('Liste Beginner'!P25=\"\",\"\",'Liste Beginner'!P25)","v":""},{"$f":"IF('Liste Beginner'!Q25=\"\",\"\",'Liste Beginner'!Q25)","v":""},{"$f":"IF('Liste Beginner'!R25=\"\",\"\",'Liste Beginner'!R25)","v":""},{"$f":"'Liste Beginner'!S25","v":0},{"$f":"'Liste Beginner'!T25","v":""},{"$f":"'Liste Beginner'!U25","v":0}]
["Start / Los / Klasse","Hundeführer/-in","Verein","Verband","Hund","Rasse",{"$f":"IF('Liste Klasse 1'!H$4=0,\"\",'Liste Klasse 1'!H$4)","v":1},{"$f":"IF('Liste Klasse 1'!I$4=0,\"\",'Liste Klasse 1'!I$4)","v":2},{"$f":"IF('Liste Klasse 1'!J$4=0,\"\",'Liste Klasse 1'!J$4)","v":3},{"$f":"IF('Liste Klasse 1'!K$4=0,\"\",'Liste Klasse 1'!K$4)","v":4},{"$f":"IF('Liste Klasse 1'!L$4=0,\"\",'Liste Klasse 1'!L$4)","v":5},{"$f":"IF('Liste Klasse 1'!M$4=0,\"\",'Liste Klasse 1'!M$4)","v":6},{"$f":"IF('Liste Klasse 1'!N$4=0,\"\",'Liste Klasse 1'!N$4)","v":7},{"$f":"IF('Liste Klasse 1'!O$4=0,\"\",'Liste Klasse 1'!O$4)","v":8},{"$f":"IF('Liste Klasse 1'!P$4=0,\"\",'Liste Klasse 1'!P$4)","v":9},{"$f":"IF('Liste Klasse 1'!Q$4=0,\"\",'Liste Klasse 1'!Q$4)","v":10},{"$f":"IF('Liste Klasse 1'!R$4=0,\"\",'Liste Klasse 1'!R$4)","v":11},"Gesamt","WN","Platz"]
[{"$f":"IF('Liste Klasse 1'!A8=\"\",\"\",'Liste Klasse 1'!A8&\" / \"&'Liste Klasse 1'!B8&\" / Klasse 1\")","v":""},{"$f":"IF('Liste Klasse 1'!C8=\"\",\"\",'Liste Klasse 1'!C8)","v":""},{"$f":"IF('Liste Klasse 1'!D8=\"\",\"\",'Liste Klasse 1'!D8)","v":""},{"$f":"IF('Liste Klasse 1'!E8=\"\",\"\",'Liste Klasse 1'!E8)","v":""},{"$f":"IF('Liste Klasse 1'!F8=\"\",\"\",'Liste Klasse 1'!F8)","v":""},{"$f":"IF('Liste Klasse 1'!G8=\"\",\"\",'Liste Klasse 1'!G8)","v":""},{"$f":"IF('Liste Klasse 1'!H8=\"\",\"\",'Liste Klasse 1'!H8)","v":""},{"$f":"IF('Liste Klasse 1'!I8=\"\",\"\",'Liste Klasse 1'!I8)","v":""},{"$f":"IF('Liste Klasse 1'!J8=\"\",\"\",'Liste Klasse 1'!J8)","v":""},{"$f":"IF('Liste Klasse 1'!K8=\"\",\"\",'Liste Klasse 1'!K8)","v":""},{"$f":"IF('Liste Klasse 1'!L8=\"\",\"\",'Liste Klasse 1'!L8)","v":""},{"$f":"IF('Liste Klasse 1'!M8=\"\",\"\",'Liste Klasse 1'!M8)","v":""},{"$f":"IF('Liste Klasse 1'!N8=\"\",\"\",'Liste Klasse 1'!N8)","v":""},{"$f":"IF('Liste Klasse 1'!O8=\"\",\"\",'Liste Klasse 1'!O8)","v":""},{"$f":"IF('Liste Klasse 1'!P8=\"\",\"\",'Liste Klasse 1'!P8)","v":""},{"$f":"IF('Liste Klasse 1'!Q8=\"\",\"\",'Liste Klasse 1'!Q8)","v":""},{"$f":"IF('Liste Klasse 1'!R8=\"\",\"\",'Liste Klasse 1'!R8)","v":""},{"$f":"'Liste Klasse 1'!S8","v":0},{"$f":"'Liste Klasse 1'!T8","v":""},{"$f":"'Liste Klasse 1'!U8","v":0}]
[{"$f":"IF('Liste Klasse 1'!A9=\"\",\"\",'Liste Klasse 1'!A9&\" / \"&'Liste Klasse 1'!B9&\" / Klasse 1\")","v":""},{"$f":"IF('Liste Klasse 1'!C9=\"\",\"\",'Liste Klasse 1'!C9)","v":""},{"$f":"IF('Liste Klasse 1'!D9=\"\",\"\",'Liste Klasse 1'!D9)","v":""},{"$f":"IF('Liste Klasse 1'!E9=\"\",\"\",'Liste Klasse 1'!E9)","v":""},{"$f":"IF('Liste Klasse 1'!F9=\"\",\"\",'Liste Klasse 1'!F9)","v":""},{"$f":"IF('Liste Klasse 1'!G9=\"\",\"\",'Liste Klasse 1'!G9)","v":""},{"$f":"IF('Liste Klasse 1'!H9=\"\",\"\",'Liste Klasse 1'!H9)","v":""},{"$f":"IF('Liste Klasse 1'!I9=\"\",\"\",'Liste Klasse 1'!I9)","v":""},{"$f":"IF('Liste Klasse 1'!J9=\"\",\"\",'Liste Klasse 1'!J9)","v":""},{"$f":"IF('Liste Klasse 1'!K9=\"\",\"\",'Liste Klasse 1'!K9)","v":""},{"$f":"IF('Liste Klasse 1'!L9=\"\",\"\",'Liste Klasse 1'!L9)","v":""},{"$f":"IF('Liste Klasse 1'!M9=\"\",\"\",'Liste Klasse 1'!M9)","v":""},{"$f":"IF('Liste Klasse 1'!N9=\"\",\"\",'Liste Klasse 1'!N9)","v":""},{"$f":"IF('Liste Klasse 1'!O9=\"\",\"\",'Liste Klasse 1'!O9)","v":""},{"$f":"IF('Liste Klasse 1'!P9=\"\",\"\",'Liste Klasse 1'!P9)","v":""},{"$f":"IF('Liste Klasse 1'!Q9=\"\",\"\",'Liste Klasse 1'!Q9)","v":""},{"$f":"IF('Liste Klasse 1'!R9=\"\",\"\",'Liste Klasse 1'!R9)","v":""},{"$f":"'Liste Klasse 1'!S9","v":0},{"$f":"'Liste Klasse 1'!T9","v":""},{"$f":"'Liste Klasse 1'!U9","v":0}]
[{"$f":"IF('Liste Klasse 1'!A10=\"\",\"\",'Liste Klasse 1'!A10&\" / \"&'Liste Klasse 1'!B10&\" / Klasse 1\")","v":""},{"$f":"IF('Liste Klasse 1'!C10=\"\",\"\",'Liste Klasse 1'!C10)","v":""},{"$f":"IF('Liste Klasse 1'!D10=\"\",\"\",'Liste Klasse 1'!D10)","v":""},{"$f":"IF('Liste Klasse 1'!E10=\"\",\"\",'Liste Klasse 1'!E10)","v":""},{"$f":"IF('Liste Klasse 1'!F10=\"\",\"\",'Liste Klasse 1'!F10)","v":""},{"$f":"IF('Liste Klasse 1'!G10=\"\",\"\",'Liste Klasse 1'!G10)","v":""},{"$f":"IF('Liste Klasse 1'!H10=\"\",\"\",'Liste Klasse 1'!H10)","v":""},{"$f":"IF('Liste Klasse 1'!I10=\"\",\"\",'Liste Klasse 1'!I10)","v":""},{"$f":"IF('Liste Klasse 1'!J10=\"\",\"\",'Liste Klasse 1'!J10)","v":""},{"$f":"IF('Liste Klasse 1'!K10=\"\",\"\",'Liste Klasse 1'!K10)","v":""},{"$f":"IF('Liste Klasse 1'!L10=\"\",\"\",'Liste Klasse 1'!L10)","v":""},{"$f":"IF('Liste Klasse 1'!M10=\"\",\"\",'Liste Klasse 1'!M10)","v":""},{"$f":"IF('Liste Klasse 1'!N10=\"\",\"\",'Liste Klasse 1'!N10)","v":""},{"$f":"IF('Liste Klasse 1'!O10=\"\",\"\",'Liste Klasse 1'!O10)","v":""},{"$f":"IF('Liste Klasse 1'!P10=\"\",\"\",'Liste Klasse 1'!P10)","v":""},{"$f":"IF('Liste Klasse 1'!Q10=\"\",\"\",'Liste Klasse 1'!Q10)","v":""},{"$f":"IF('Liste Klasse 1'!R10=\"\",\"\",'Liste Klasse 1'!R10)","v":""},{"$f":"'Liste Klasse 1'!S10","v":0},{"$f":"'Liste Klasse 1'!T10","v":""},{"$f":"'Liste Klasse 1'!U10","v":0}]
[{"$f":"IF('Liste Klasse 1'!A11=\"\",\"\",'Liste Klasse 1'!A11&\" / \"&'Liste Klasse 1'!B11&\" / Klasse 1\")","v":""},{"$f":"IF('Liste Klasse 1'!C11=\"\",\"\",'Liste Klasse 1'!C11)","v":""},{"$f":"IF('Liste Klasse 1'!D11=\"\",\"\",'Liste Klasse 1'!D11)","v":""},{"$f":"IF('Liste Klasse 1'!E11=\"\",\"\",'Liste Klasse 1'!E11)","v":""},{"$f":"IF('Liste Klasse 1'!F11=\"\",\"\",'Liste Klasse 1'!F11)","v":""},{"$f":"IF('Liste Klasse 1'!G11=\"\",\"\",'Liste Klasse 1'!G11)","v":""},{"$f":"IF('Liste Klasse 1'!H11=\"\",\"\",'Liste Klasse 1'!H11)","v":""},{"$f":"IF('Liste Klasse 1'!I11=\"\",\"\",'Liste Klasse 1'!I11)","v":""},{"$f":"IF('Liste Klasse 1'!J11=\"\",\"\",'Liste Klasse 1'!J11)","v":""},{"$f":"IF('Liste Klasse 1'!K11=\"\",\"\",'Liste Klasse 1'!K11)","v":""},{"$f":"IF('Liste Klasse 1'!L11=\"\",\"\",'Liste Klasse 1'!L11)","v":""},{"$f":"IF('Liste Klasse 1'!M11=\"\",\"\",'Liste Klasse 1'!M11)","v":""},{"$f":"IF('Liste Klasse 1'!N11=\"\",\"\",'Liste Klasse 1'!N11)","v":""},{"$f":"IF('Liste Klasse 1'!O11=\"\",\"\",'Liste Klasse 1'!O11)","v":""},{"$f":"IF('Liste Klasse 1'!P11=\"\",\"\",'Liste Klasse 1'!P11)","v":""},{"$f":"IF('Liste Klasse 1'!Q11=\"\",\"\",'Liste Klasse 1'!Q11)","v":""},{"$f":"IF('Liste Klasse 1'!R11=\"\",\"\",'Liste Klasse 1'!R11)","v":""},{"$f":"'Liste Klasse 1'!S11","v":0},{"$f":"'Liste Klasse 1'!T11","v":""},{"$f":"'Liste Klasse 1'!U11","v":0}]
[{"$f":"IF('Liste Klasse 1'!A12=\"\",\"\",'Liste Klasse 1'!A12&\" / \"&'Liste Klasse 1'!B12&\" / Klasse 1\")","v":""},{"$f":"IF('Liste Klasse 1'!C12=\"\",\"\",'Liste Klasse 1'!C12)","v":""},{"$f":"IF('Liste Klasse 1'!D12=\"\",\"\",'Liste Klasse 1'!D12)","v":""},{"$f":"IF('Liste Klasse 1'!E12=\"\",\"\",'Liste Klasse 1'!E12)","v":""},{"$f":"IF('Liste Klasse 1'!F12=\"\",\"\",'Liste Klasse 1'!F12)","v":""},{"$f":"IF('Liste Klasse 1'!G12=\"\",\"\",'Liste Klasse 1'!G12)","v":""},{"$f":"IF('Liste Klasse 1'!H12=\"\",\"\",'Liste Klasse 1'!H12)","v":""},{"$f":"IF('Liste Klasse 1'!I12=\"\",\"\",'Liste Klasse 1'!I12)","v":""},{"$f":"IF('Liste Klasse 1'!J12=\"\",\"\",'Liste Klasse 1'!J12)","v":""},{"$f":"IF('Liste Klasse 1'!K12=\"\",\"\",'Liste Klasse 1'!K12)","v":""},{"$f":"IF('Liste Klasse 1'!L12=\"\",\"\",'Liste Klasse 1'!L12)","v":""},{"$f":"IF('Liste Klasse 1'!M12=\"\",\"\",'Liste Klasse 1'!M12)","v":""},{"$f":"IF('Liste Klasse 1'!N12=\"\",\"\",'Liste Klasse 1'!N12)","v":""},{"$f":"IF('Liste Klasse 1'!O12=\"\",\"\",'Liste Klasse 1'!O12)","v":""},{"$f":"IF('Liste Klasse 1'!P12=\"\",\"\",'Liste Klasse 1'!P12)","v":""},{"$f":"IF('Liste Klasse 1'!Q12=\"\",\"\",'Liste Klasse 1'!Q12)","v":""},{"$f":"IF('Liste Klasse 1'!R12=\"\",\"\",'Liste Klasse 1'!R12)","v":""},{"$f":"'Liste Klasse 1'!S12","v":0},{"$f":"'Liste Klasse 1'!T12","v":""},{"$f":"'Liste Klasse 1'!U12","v":0}]
[{"$f":"IF('Liste Klasse 1'!A13=\"\",\"\",'Liste Klasse 1'!A13&\" / \"&'Liste Klasse 1'!B13&\" / Klasse 1\")","v":""},{"$f":"IF('Liste Klasse 1'!C13=\"\",\"\",'Liste Klasse 1'!C13)","v":""},{"$f":"IF('Liste Klasse 1'!D13=\"\",\"\",'Liste Klasse 1'!D13)","v":""},{"$f":"IF('Liste Klasse 1'!E13=\"\",\"\",'Liste Klasse 1'!E13)","v":""},{"$f":"IF('Liste Klasse 1'!F13=\"\",\"\",'Liste Klasse 1'!F13)","v":""},{"$f":"IF('Liste Klasse 1'!G13=\"\",\"\",'Liste Klasse 1'!G13)","v":""},{"$f":"IF('Liste Klasse 1'!H13=\"\",\"\",'Liste Klasse 1'!H13)","v":""},{"$f":"IF('Liste Klasse 1'!I13=\"\",\"\",'Liste Klasse 1'!I13)","v":""},{"$f":"IF('Liste Klasse 1'!J13=\"\",\"\",'Liste Klasse 1'!J13)","v":""},{"$f":"IF('Liste Klasse 1'!K13=\"\",\"\",'Liste Klasse 1'!K13)","v":""},{"$f":"IF('Liste Klasse 1'!L13=\"\",\"\",'Liste Klasse 1'!L13)","v":""},{"$f":"IF('Liste Klasse 1'!M13=\"\",\"\",'Liste Klasse 1'!M13)","v":""},{"$f":"IF('Liste Klasse 1'!N13=\"\",\"\",'Liste Klasse 1'!N13)","v":""},{"$f":"IF('Liste Klasse 1'!O13=\"\",\"\",'Liste Klasse 1'!O13)","v":""},{"$f":"IF('Liste Klasse 1'!P13=\"\",\"\",'Liste Klasse 1'!P13)","v":""},{"$f":"IF('Liste Klasse 1'!Q13=\"\",\"\",'Liste Klasse 1'!Q13)","v":""},{"$f":"IF('Liste Klasse 1'!R13=\"\",\"\",'Liste Klasse 1'!R13)","v":""},{"$f":"'Liste Klasse 1'!S13","v":0},{"$f":"'Liste Klasse 1'!T13","v":""},{"$f":"'Liste Klasse 1'!U13","v":0}]
[{"$f":"IF('Liste Klasse 1'!A14=\"\",\"\",'Liste Klasse 1'!A14&\" / \"&'Liste Klasse 1'!B14&\" / Klasse 1\")","v":""},{"$f":"IF('Liste Klasse 1'!C14=\"\",\"\",'Liste Klasse 1'!C14)","v":""},{"$f":"IF('Liste Klasse 1'!D14=\"\",\"\",'Liste Klasse 1'!D14)","v":""},{"$f":"IF('Liste Klasse 1'!E14=\"\",\"\",'Liste Klasse 1'!E14)","v":""},{"$f":"IF('Liste Klasse 1'!F14=\"\",\"\",'Liste Klasse 1'!F14)","v":""},{"$f":"IF('Liste Klasse 1'!G14=\"\",\"\",'Liste Klasse 1'!G14)","v":""},{"$f":"IF('Liste Klasse 1'!H14=\"\",\"\",'Liste Klasse 1'!H14)","v":""},{"$f":"IF('Liste Klasse 1'!I14=\"\",\"\",'Liste Klasse 1'!I14)","v":""},{"$f":"IF('Liste Klasse 1'!J14=\"\",\"\",'Liste Klasse 1'!J14)","v":""},{"$f":"IF('Liste Klasse 1'!K14=\"\",\"\",'Liste Klasse 1'!K14)","v":""},{"$f":"IF('Liste Klasse 1'!L14=\"\",\"\",'Liste Klasse 1'!L14)","v":""},{"$f":"IF('Liste Klasse 1'!M14=\"\",\"\",'Liste Klasse 1'!M14)","v":""},{"$f":"IF('Liste Klasse 1'!N14=\"\",\"\",'Liste Klasse 1'!N14)","v":""},{"$f":"IF('Liste Klasse 1'!O14=\"\",\"\",'Liste Klasse 1'!O14)","v":""},{"$f":"IF('Liste Klasse 1'!P14=\"\",\"\",'Liste Klasse 1'!P14)","v":""},{"$f":"IF('Liste Klasse 1'!Q14=\"\",\"\",'Liste Klasse 1'!Q14)","v":""},{"$f":"IF('Liste Klasse 1'!R14=\"\",\"\",'Liste Klasse 1'!R14)","v":""},{"$f":"'Liste Klasse 1'!S14","v":0},{"$f":"'Liste Klasse 1'!T14","v":""},{"$f":"'Liste Klasse 1'!U14","v":0}]
[{"$f":"IF('Liste Klasse 1'!A15=\"\",\"\",'Liste Klasse 1'!A15&\" / \"&'Liste Klasse 1'!B15&\" / Klasse 1\")","v":""},{"$f":"IF('Liste Klasse 1'!C15=\"\",\"\",'Liste Klasse 1'!C15)","v":""},{"$f":"IF('Liste Klasse 1'!D15=\"\",\"\",'Liste Klasse 1'!D15)","v":""},{"$f":"IF('Liste Klasse 1'!E15=\"\",\"\",'Liste Klasse 1'!E15)","v":""},{"$f":"IF('Liste Klasse 1'!F15=\"\",\"\",'Liste Klasse 1'!F15)","v":""},{"$f":"IF('Liste Klasse 1'!G15=\"\",\"\",'Liste Klasse 1'!G15)","v":""},{"$f":"IF('Liste Klasse 1'!H15=\"\",\"\",'Liste Klasse 1'!H15)","v":""},{"$f":"IF('Liste Klasse 1'!I15=\"\",\"\",'Liste Klasse 1'!I15)","v":""},{"$f":"IF('Liste Klasse 1'!J15=\"\",\"\",'Liste Klasse 1'!J15)","v":""},{"$f":"IF('Liste Klasse 1'!K15=\"\",\"\",'Liste Klasse 1'!K15)","v":""},{"$f":"IF('Liste Klasse 1'!L15=\"\",\"\",'Liste Klasse 1'!L15)","v":""},{"$f":"IF('Liste Klasse 1'!M15=\"\",\"\",'Liste Klasse 1'!M15)","v":""},{"$f":"IF('Liste Klasse 1'!N15=\"\",\"\",'Liste Klasse 1'!N15)","v":""},{"$f":"IF('Liste Klasse 1'!O15=\"\",\"\",'Liste Klasse 1'!O15)","v":""},{"$f":"IF('Liste Klasse 1'!P15=\"\",\"\",'Liste Klasse 1'!P15)","v":""},{"$f":"IF('Liste Klasse 1'!Q15=\"\",\"\",'Liste Klasse 1'!Q15)","v":""},{"$f":"IF('Liste Klasse 1'!R15=\"\",\"\",'Liste Klasse 1'!R15)","v":""},{"$f":"'Liste Klasse 1'!S15","v":0},{"$f":"'Liste Klasse 1'!T15","v":""},{"$f":"'Liste Klasse 1'!U15","v":0}]
[{"$f":"IF('Liste Klasse 1'!A16=\"\",\"\",'Liste Klasse 1'!A16&\" / \"&'Liste Klasse 1'!B16&\" / Klasse 1\")","v":""},{"$f":"IF('Liste Klasse 1'!C16=\"\",\"\",'Liste Klasse 1'!C16)","v":""},{"$f":"IF('Liste Klasse 1'!D16=\"\",\"\",'Liste Klasse 1'!D16)","v":""},{"$f":"IF('Liste Klasse 1'!E16=\"\",\"\",'Liste Klasse 1'!E16)","v":""},{"$f":"IF('Liste Klasse 1'!F16=\"\",\"\",'Liste Klasse 1'!F16)","v":""},{"$f":"IF('Liste Klasse 1'!G16=\"\",\"\",'Liste Klasse 1'!G16)","v":""},{"$f":"IF('Liste Klasse 1'!H16=\"\",\"\",'Liste Klasse 1'!H16)","v":""},{"$f":"IF('Liste Klasse 1'!I16=\"\",\"\",'Liste Klasse 1'!I16)","v":""},{"$f":"IF('Liste Klasse 1'!J16=\"\",\"\",'Liste Klasse 1'!J16)","v":""},{"$f":"IF('Liste Klasse 1'!K16=\"\",\"\",'Liste Klasse 1'!K16)","v":""},{"$f":"IF('Liste Klasse 1'!L16=\"\",\"\",'Liste Klasse 1'!L16)","v":""},{"$f":"IF('Liste Klasse 1'!M16=\"\",\"\",'Liste Klasse 1'!M16)","v":""},{"$f":"IF('Liste Klasse 1'!N16=\"\",\"\",'Liste Klasse 1'!N16)","v":""},{"$f":"IF('Liste Klasse 1'!O16=\"\",\"\",'Liste Klasse 1'!O16)","v":""},{"$f":"IF('Liste Klasse 1'!P16=\"\",\"\",'Liste Klasse 1'!P16)","v":""},{"$f":"IF('Liste Klasse 1'!Q16=\"\",\"\",'Liste Klasse 1'!Q16)","v":""},{"$f":"IF('Liste Klasse 1'!R16=\"\",\"\",'Liste Klasse 1'!R16)","v":""},{"$f":"'Liste Klasse 1'!S16","v":0},{"$f":"'Liste Klasse 1'!T16","v":""},{"$f":"'Liste Klasse 1'!U16","v":0}]
[{"$f":"IF('Liste Klasse 1'!A17=\"\",\"\",'Liste Klasse 1'!A17&\" / \"&'Liste Klasse 1'!B17&\" / Klasse 1\")","v":""},{"$f":"IF('Liste Klasse 1'!C17=\"\",\"\",'Liste Klasse 1'!C17)","v":""},{"$f":"IF('Liste Klasse 1'!D17=\"\",\"\",'Liste Klasse 1'!D17)","v":""},{"$f":"IF('Liste Klasse 1'!E17=\"\",\"\",'Liste Klasse 1'!E17)","v":""},{"$f":"IF('Liste Klasse 1'!F17=\"\",\"\",'Liste Klasse 1'!F17)","v":""},{"$f":"IF('Liste Klasse 1'!G17=\"\",\"\",'Liste Klasse 1'!G17)","v":""},{"$f":"IF('Liste Klasse 1'!H17=\"\",\"\",'Liste Klasse 1'!H17)","v":""},{"$f":"IF('Liste Klasse 1'!I17=\"\",\"\",'Liste Klasse 1'!I17)","v":""},{"$f":"IF('Liste Klasse 1'!J17=\"\",\"\",'Liste Klasse 1'!J17)","v":""},{"$f":"IF('Liste Klasse 1'!K17=\"\",\"\",'Liste Klasse 1'!K17)","v":""},{"$f":"IF('Liste Klasse 1'!L17=\"\",\"\",'Liste Klasse 1'!L17)","v":""},{"$f":"IF('Liste Klasse 1'!M17=\"\",\"\",'Liste Klasse 1'!M17)","v":""},{"$f":"IF('Liste Klasse 1'!N17=\"\",\"\",'Liste Klasse 1'!N17)","v":""},{"$f":"IF('Liste Klasse 1'!O17=\"\",\"\",'Liste Klasse 1'!O17)","v":""},{"$f":"IF('Liste Klasse 1'!P17=\"\",\"\",'Liste Klasse 1'!P17)","v":""},{"$f":"IF('Liste Klasse 1'!Q17=\"\",\"\",'Liste Klasse 1'!Q17)","v":""},{"$f":"IF('Liste Klasse 1'!R17=\"\",\"\",'Liste Klasse 1'!R17)","v":""},{"$f":"'Liste Klasse 1'!S17","v":0},{"$f":"'Liste Klasse 1'!T17","v":""},{"$f":"'Liste Klasse 1'!U17","v":0}]
[{"$f":"IF('Liste Klasse 1'!A18=\"\",\"\",'Liste Klasse 1'!A18&\" / \"&'Liste Klasse 1'!B18&\" / Klasse 1\")","v":""},{"$f":"IF('Liste Klasse 1'!C18=\"\",\"\",'Liste Klasse 1'!C18)","v":""},{"$f":"IF('Liste Klasse 1'!D18=\"\",\"\",'Liste Klasse 1'!D18)","v":""},{"$f":"IF('Liste Klasse 1'!E18=\"\",\"\",'Liste Klasse 1'!E18)","v":""},{"$f":"IF('Liste Klasse 1'!F18=\"\",\"\",'Liste Klasse 1'!F18)","v":""},{"$f":"IF('Liste Klasse 1'!G18=\"\",\"\",'Liste Klasse 1'!G18)","v":""},{"$f":"IF('Liste Klasse 1'!H18=\"\",\"\",'Liste Klasse 1'!H18)","v":""},{"$f":"IF('Liste Klasse 1'!I18=\"\",\"\",'Liste Klasse 1'!I18)","v":""},{"$f":"IF('Liste Klasse 1'!J18=\"\",\"\",'Liste Klasse 1'!J18)","v":""},{"$f":"IF('Liste Klasse 1'!K18=\"\",\"\",'Liste Klasse 1'!K18)","v":""},{"$f":"IF('Liste Klasse 1'!L18=\"\",\"\",'Liste Klasse 1'!L18)","v":""},{"$f":"IF('Liste Klasse 1'!M18=\"\",\"\",'Liste Klasse 1'!M18)","v":""},{"$f":"IF('Liste Klasse 1'!N18=\"\",\"\",'Liste Klasse 1'!N18)","v":""},{"$f":"IF('Liste Klasse 1'!O18=\"\",\"\",'Liste Klasse 1'!O18)","v":""},{"$f":"IF('Liste Klasse 1'!P18=\"\",\"\",'Liste Klasse 1'!P18)","v":""},{"$f":"IF('Liste Klasse 1'!Q18=\"\",\"\",'Liste Klasse 1'!Q18)","v":""},{"$f":"IF('Liste Klasse 1'!R18=\"\",\"\",'Liste Klasse 1'!R18)","v":""},{"$f":"'Liste Klasse 1'!S18","v":0},{"$f":"'Liste Klasse 1'!T18","v":""},{"$f":"'Liste Klasse 1'!U18","v":0}]
[{"$f":"IF('Liste Klasse 1'!A19=\"\",\"\",'Liste Klasse 1'!A19&\" / \"&'Liste Klasse 1'!B19&\" / Klasse 1\")","v":""},{"$f":"IF('Liste Klasse 1'!C19=\"\",\"\",'Liste Klasse 1'!C19)","v":""},{"$f":"IF('Liste Klasse 1'!D19=\"\",\"\",'Liste Klasse 1'!D19)","v":""},{"$f":"IF('Liste Klasse 1'!E19=\"\",\"\",'Liste Klasse 1'!E19)","v":""},{"$f":"IF('Liste Klasse 1'!F19=\"\",\"\",'Liste Klasse 1'!F19)","v":""},{"$f":"IF('Liste Klasse 1'!G19=\"\",\"\",'Liste Klasse 1'!G19)","v":""},{"$f":"IF('Liste Klasse 1'!H19=\"\",\"\",'Liste Klasse 1'!H19)","v":""},{"$f":"IF('Liste Klasse 1'!I19=\"\",\"\",'Liste Klasse 1'!I19)","v":""},{"$f":"IF('Liste Klasse 1'!J19=\"\",\"\",'Liste Klasse 1'!J19)","v":""},{"$f":"IF('Liste Klasse 1'!K19=\"\",\"\",'Liste Klasse 1'!K19)","v":""},{"$f":"IF('Liste Klasse 1'!L19=\"\",\"\",'Liste Klasse 1'!L19)","v":""},{"$f":"IF('Liste Klasse 1'!M19=\"\",\"\",'Liste Klasse 1'!M19)","v":""},{"$f":"IF('Liste Klasse 1'!N19=\"\",\"\",'Liste Klasse 1'!N19)","v":""},{"$f":"IF('Liste Klasse 1'!O19=\"\",\"\",'Liste Klasse 1'!O19)","v":""},{"$f":"IF('Liste Klasse 1'!P19=\"\",\"\",'Liste Klasse 1'!P19)","v":""},{"$f":"IF('Liste Klasse 1'!Q19=\"\",\"\",'Liste Klasse 1'!Q19)","v":""},{"$f":"IF('Liste Klasse 1'!R19=\"\",\"\",'Liste Klasse 1'!R19)","v":""},{"$f":"'Liste Klasse 1'!S19","v":0},{"$f":"'Liste Klasse 1'!T19","v":""},{"$f":"'Liste Klasse 1'!U19","v":0}]
[{"$f":"IF('Liste Klasse 1'!A20=\"\",\"\",'Liste Klasse 1'!A20&\" / \"&'Liste Klasse 1'!B20&\" / Klasse 1\")","v":""},{"$f":"IF('Liste Klasse 1'!C20=\"\",\"\",'Liste Klasse 1'!C20)","v":""},{"$f":"IF('Liste Klasse 1'!D20=\"\",\"\",'Liste Klasse 1'!D20)","v":""},{"$f":"IF('Liste Klasse 1'!E20=\"\",\"\",'Liste Klasse 1'!E20)","v":""},{"$f":"IF('Liste Klasse 1'!F20=\"\",\"\",'Liste Klasse 1'!F20)","v":""},{"$f":"IF('Liste Klasse 1'!G20=\"\",\"\",'Liste Klasse 1'!G20)","v":""},{"$f":"IF('Liste Klasse 1'!H20=\"\",\"\",'Liste Klasse 1'!H20)","v":""},{"$f":"IF('Liste Klasse 1'!I20=\"\",\"\",'Liste Klasse 1'!I20)","v":""},{"$f":"IF('Liste Klasse 1'!J20=\"\",\"\",'Liste Klasse 1'!J20)","v":""},{"$f":"IF('Liste Klasse 1'!K20=\"\",\"\",'Liste Klasse 1'!K20)","v":""},{"$f":"IF('Liste Klasse 1'!L20=\"\",\"\",'Liste Klasse 1'!L20)","v":""},{"$f":"IF('Liste Klasse 1'!M20=\"\",\"\",'Liste Klasse 1'!M20)","v":""},{"$f":"IF('Liste Klasse 1'!N20=\"\",\"\",'Liste Klasse 1'!N20)","v":""},{"$f":"IF('Liste Klasse 1'!O20=\"\",\"\",'Liste Klasse 1'!O20)","v":""},{"$f":"IF('Liste Klasse 1'!P20=\"\",\"\",'Liste Klasse 1'!P20)","v":""},{"$f":"IF('Liste Klasse 1'!Q20=\"\",\"\",'Liste Klasse 1'!Q20)","v":""},{"$f":"IF('Liste Klasse 1'!R20=\"\",\"\",'Liste Klasse 1'!R20)","v":""},{"$f":"'Liste Klasse 1'!S20","v":0},{"$f":"'Liste Klasse 1'!T20","v":""},{"$f":"'Liste Klasse 1'!U20","v":0}]
[{"$f":"IF('Liste Klasse 1'!A21=\"\",\"\",'Liste Klasse 1'!A21&\" / \"&'Liste Klasse 1'!B21&\" / Klasse 1\")","v":""},{"$f":"IF('Liste Klasse 1'!C21=\"\",\"\",'Liste Klasse 1'!C21)","v":""},{"$f":"IF('Liste Klasse 1'!D21=\"\",\"\",'Liste Klasse 1'!D21)","v":""},{"$f":"IF('Liste Klasse 1'!E21=\"\",\"\",'Liste Klasse 1'!E21)","v":""},{"$f":"IF('Liste Klasse 1'!F21=\"\",\"\",'Liste Klasse 1'!F21)","v":""},{"$f":"IF('Liste Klasse 1'!G21=\"\",\"\",'Liste Klasse 1'!G21)","v":""},{"$f":"IF('Liste Klasse 1'!H21=\"\",\"\",'Liste Klasse 1'!H21)","v":""},{"$f":"IF('Liste Klasse 1'!I21=\"\",\"\",'Liste Klasse 1'!I21)","v":""},{"$f":"IF('Liste Klasse 1'!J21=\"\",\"\",'Liste Klasse 1'!J21)","v":""},{"$f":"IF('Liste Klasse 1'!K21=\"\",\"\",'Liste Klasse 1'!K21)","v":""},{"$f":"IF('Liste Klasse 1'!L21=\"\",\"\",'Liste Klasse 1'!L21)","v":""},{"$f":"IF('Liste Klasse 1'!M21=\"\",\"\",'Liste Klasse 1'!M21)","v":""},{"$f":"IF('Liste Klasse 1'!N21=\"\",\"\",'Liste Klasse 1'!N21)","v":""},{"$f":"IF('Liste Klasse 1'!O21=\"\",\"\",'Liste Klasse 1'!O21)","v":""},{"$f":"IF('Liste Klasse 1'!P21=\"\",\"\",'Liste Klasse 1'!P21)","v":""},{"$f":"IF('Liste Klasse 1'!Q21=\"\",\"\",'Liste Klasse 1'!Q21)","v":""},{"$f":"IF('Liste Klasse 1'!R21=\"\",\"\",'Liste Klasse 1'!R21)","v":""},{"$f":"'Liste Klasse 1'!S21","v":0},{"$f":"'Liste Klasse 1'!T21","v":""},{"$f":"'Liste Klasse 1'!U21","v":0}]
[{"$f":"IF('Liste Klasse 1'!A22=\"\",\"\",'Liste Klasse 1'!A22&\" / \"&'Liste Klasse 1'!B22&\" / Klasse 1\")","v":""},{"$f":"IF('Liste Klasse 1'!C22=\"\",\"\",'Liste Klasse 1'!C22)","v":""},{"$f":"IF('Liste Klasse 1'!D22=\"\",\"\",'Liste Klasse 1'!D22)","v":""},{"$f":"IF('Liste Klasse 1'!E22=\"\",\"\",'Liste Klasse 1'!E22)","v":""},{"$f":"IF('Liste Klasse 1'!F22=\"\",\"\",'Liste Klasse 1'!F22)","v":""},{"$f":"IF('Liste Klasse 1'!G22=\"\",\"\",'Liste Klasse 1'!G22)","v":""},{"$f":"IF('Liste Klasse 1'!H22=\"\",\"\",'Liste Klasse 1'!H22)","v":""},{"$f":"IF('Liste Klasse 1'!I22=\"\",\"\",'Liste Klasse 1'!I22)","v":""},{"$f":"IF('Liste Klasse 1'!J22=\"\",\"\",'Liste Klasse 1'!J22)","v":""},{"$f":"IF('Liste Klasse 1'!K22=\"\",\"\",'Liste Klasse 1'!K22)","v":""},{"$f":"IF('Liste Klasse 1'!L22=\"\",\"\",'Liste Klasse 1'!L22)","v":""},{"$f":"IF('Liste Klasse 1'!M22=\"\",\"\",'Liste Klasse 1'!M22)","v":""},{"$f":"IF('Liste Klasse 1'!N22=\"\",\"\",'Liste Klasse 1'!N22)","v":""},{"$f":"IF('Liste Klasse 1'!O22=\"\",\"\",'Liste Klasse 1'!O22)","v":""},{"$f":"IF('Liste Klasse 1'!P22=\"\",\"\",'Liste Klasse 1'!P22)","v":""},{"$f":"IF('Liste Klasse 1'!Q22=\"\",\"\",'Liste Klasse 1'!Q22)","v":""},{"$f":"IF('Liste Klasse 1'!R22=\"\",\"\",'Liste Klasse 1'!R22)","v":""},{"$f":"'Liste Klasse 1'!S22","v":0},{"$f":"'Liste Klasse 1'!T22","v":""},{"$f":"'Liste Klasse 1'!U22","v":0}]
[{"$f":"IF('Liste Klasse 1'!A23=\"\",\"\",'Liste Klasse 1'!A23&\" / \"&'Liste Klasse 1'!B23&\" / Klasse 1\")","v":""},{"$f":"IF('Liste Klasse 1'!C23=\"\",\"\",'Liste Klasse 1'!C23)","v":""},{"$f":"IF('Liste Klasse 1'!D23=\"\",\"\",'Liste Klasse 1'!D23)","v":""},{"$f":"IF('Liste Klasse 1'!E23=\"\",\"\",'Liste Klasse 1'!E23)","v":""},{"$f":"IF('Liste Klasse 1'!F23=\"\",\"\",'Liste Klasse 1'!F23)","v":""},{"$f":"IF('Liste Klasse 1'!G23=\"\",\"\",'Liste Klasse 1'!G23)","v":""},{"$f":"IF('Liste Klasse 1'!H23=\"\",\"\",'Liste Klasse 1'!H23)","v":""},{"$f":"IF('Liste Klasse 1'!I23=\"\",\"\",'Liste Klasse 1'!I23)","v":""},{"$f":"IF('Liste Klasse 1'!J23=\"\",\"\",'Liste Klasse 1'!J23)","v":""},{"$f":"IF('Liste Klasse 1'!K23=\"\",\"\",'Liste Klasse 1'!K23)","v":""},{"$f":"IF('Liste Klasse 1'!L23=\"\",\"\",'Liste Klasse 1'!L23)","v":""},{"$f":"IF('Liste Klasse 1'!M23=\"\",\"\",'Liste Klasse 1'!M23)","v":""},{"$f":"IF('Liste Klasse 1'!N23=\"\",\"\",'Liste Klasse 1'!N23)","v":""},{"$f":"IF('Liste Klasse 1'!O23=\"\",\"\",'Liste Klasse 1'!O23)","v":""},{"$f":"IF('Liste Klasse 1'!P23=\"\",\"\",'Liste Klasse 1'!P23)","v":""},{"$f":"IF('Liste Klasse 1'!Q23=\"\",\"\",'Liste Klasse 1'!Q23)","v":""},{"$f":"IF('Liste Klasse 1'!R23=\"\",\"\",'Liste Klasse 1'!R23)","v":""},{"$f":"'Liste Klasse 1'!S23","v":0},{"$f":"'Liste Klasse 1'!T23","v":""},{"$f":"'Liste Klasse 1'!U23","v":0}]
[{"$f":"IF('Liste Klasse 1'!A24=\"\",\"\",'Liste Klasse 1'!A24&\" / \"&'Liste Klasse 1'!B24&\" / Klasse 1\")","v":""},{"$f":"IF('Liste Klasse 1'!C24=\"\",\"\",'Liste Klasse 1'!C24)","v":""},{"$f":"IF('Liste Klasse 1'!D24=\"\",\"\",'Liste Klasse 1'!D24)","v":""},{"$f":"IF('Liste Klasse 1'!E24=\"\",\"\",'Liste Klasse 1'!E24)","v":""},{"$f":"IF('Liste Klasse 1'!F24=\"\",\"\",'Liste Klasse 1'!F24)","v":""},{"$f":"IF('Liste Klasse 1'!G24=\"\",\"\",'Liste Klasse 1'!G24)","v":""},{"$f":"IF('Liste Klasse 1'!H24=\"\",\"\",'Liste Klasse 1'!H24)","v":""},{"$f":"IF('Liste Klasse 1'!I24=\"\",\"\",'Liste Klasse 1'!I24)","v":""},{"$f":"IF('Liste Klasse 1'!J24=\"\",\"\",'Liste Klasse 1'!J24)","v":""},{"$f":"IF('Liste Klasse 1'!K24=\"\",\"\",'Liste Klasse 1'!K24)","v":""},{"$f":"IF('Liste Klasse 1'!L24=\"\",\"\",'Liste Klasse 1'!L24)","v":""},{"$f":"IF('Liste Klasse 1'!M24=\"\",\"\",'Liste Klasse 1'!M24)","v":""},{"$f":"IF('Liste Klasse 1'!N24=\"\",\"\",'Liste Klasse 1'!N24)","v":""},{"$f":"IF('Liste Klasse 1'!O24=\"\",\"\",'Liste Klasse 1'!O24)","v":""},{"$f":"IF('Liste Klasse 1'!P24=\"\",\"\",'Liste Klasse 1'!P24)","v":""},{"$f":"IF('Liste Klasse 1'!Q24=\"\",\"\",'Liste Klasse 1'!Q24)","v":""},{"$f":"IF('Liste Klasse 1'!R24=\"\",\"\",'Liste Klasse 1'!R24)","v":""},{"$f":"'Liste Klasse 1'!S24","v":0},{"$f":"'Liste Klasse 1'!T24","v":""},{"$f":"'Liste Klasse 1'!U24","v":0}]
[{"$f":"IF('Liste Klasse 1'!A25=\"\",\"\",'Liste Klasse 1'!A25&\" / \"&'Liste Klasse 1'!B25&\" / Klasse 1\")","v":""},{"$f":"IF('Liste Klasse 1'!C25=\"\",\"\",'Liste Klasse 1'!C25)","v":""},{"$f":"IF('Liste Klasse 1'!D25=\"\",\"\",'Liste Klasse 1'!D25)","v":""},{"$f":"IF('Liste Klasse 1'!E25=\"\",\"\",'Liste Klasse 1'!E25)","v":""},{"$f":"IF('Liste Klasse 1'!F25=\"\",\"\",'Liste Klasse 1'!F25)","v":""},{"$f":"IF('Liste Klasse 1'!G25=\"\",\"\",'Liste Klasse 1'!G25)","v":""},{"$f":"IF('Liste Klasse 1'!H25=\"\",\"\",'Liste Klasse 1'!H25)","v":""},{"$f":"IF('Liste Klasse 1'!I25=\"\",\"\",'Liste Klasse 1'!I25)","v":""},{"$f":"IF('Liste Klasse 1'!J25=\"\",\"\",'Liste Klasse 1'!J25)","v":""},{"$f":"IF('Liste Klasse 1'!K25=\"\",\"\",'Liste Klasse 1'!K25)","v":""},{"$f":"IF('Liste Klasse 1'!L25=\"\",\"\",'Liste Klasse 1'!L25)","v":""},{"$f":"IF('Liste Klasse 1'!M25=\"\",\"\",'Liste Klasse 1'!M25)","v":""},{"$f":"IF('Liste Klasse 1'!N25=\"\",\"\",'Liste Klasse 1'!N25)","v":""},{"$f":"IF('Liste Klasse 1'!O25=\"\",\"\",'Liste Klasse 1'!O25)","v":""},{"$f":"IF('Liste Klasse 1'!P25=\"\",\"\",'Liste Klasse 1'!P25)","v":""},{"$f":"IF('Liste Klasse 1'!Q25=\"\",\"\",'Liste Klasse 1'!Q25)","v":""},{"$f":"IF('Liste Klasse 1'!R25=\"\",\"\",'Liste Klasse 1'!R25)","v":""},{"$f":"'Liste Klasse 1'!S25","v":0},{"$f":"'Liste Klasse 1'!T25","v":""},{"$f":"'Liste Klasse 1'!U25","v":0}]
["Start / Los / Klasse","Hundeführer/-in","Verein","Verband","Hund","Rasse",{"$f":"IF('Liste Klasse 2'!H$4=0,\"\",'Liste Klasse 2'!H$4)","v":1},{"$f":"IF('Liste Klasse 2'!I$4=0,\"\",'Liste Klasse 2'!I$4)","v":2},{"$f":"IF('Liste Klasse 2'!J$4=0,\"\",'Liste Klasse 2'!J$4)","v":3},{"$f":"IF('Liste Klasse 2'!K$4=0,\"\",'Liste Klasse 2'!K$4)","v":4},{"$f":"IF('Liste Klasse 2'!L$4=0,\"\",'Liste Klasse 2'!L$4)","v":5},{"$f":"IF('Liste Klasse 2'!M$4=0,\"\",'Liste Klasse 2'!M$4)","v":6},{"$f":"IF('Liste Klasse 2'!N$4=0,\"\",'Liste Klasse 2'!N$4)","v":7},{"$f":"IF('Liste Klasse 2'!O$4=0,\"\",'Liste Klasse 2'!O$4)","v":8},{"$f":"IF('Liste Klasse 2'!P$4=0,\"\",'Liste Klasse 2'!P$4)","v":9},{"$f":"IF('Liste Klasse 2'!Q$4=0,\"\",'Liste Klasse 2'!Q$4)","v":10},{"$f":"IF('Liste Klasse 2'!R$4=0,\"\",'Liste Klasse 2'!R$4)","v":""},"Gesamt","WN","Platz"]
[{"$f":"IF('Liste Klasse 2'!A8=\"\",\"\",'Liste Klasse 2'!A8&\" / \"&'Liste Klasse 2'!B8&\" / Klasse 2\")","v":""},{"$f":"IF('Liste Klasse 2'!C8=\"\",\"\",'Liste Klasse 2'!C8)","v":""},{"$f":"IF('Liste Klasse 2'!D8=\"\",\"\",'Liste Klasse 2'!D8)","v":""},{"$f":"IF('Liste Klasse 2'!E8=\"\",\"\",'Liste Klasse 2'!E8)","v":""},{"$f":"IF('Liste Klasse 2'!F8=\"\",\"\",'Liste Klasse 2'!F8)","v":""},{"$f":"IF('Liste Klasse 2'!G8=\"\",\"\",'Liste Klasse 2'!G8)","v":""},{"$f":"IF('Liste Klasse 2'!H8=\"\",\"\",'Liste Klasse 2'!H8)","v":""},{"$f":"IF('Liste Klasse 2'!I8=\"\",\"\",'Liste Klasse 2'!I8)","v":""},{"$f":"IF('Liste Klasse 2'!J8=\"\",\"\",'Liste Klasse 2'!J8)","v":""},{"$f":"IF('Liste Klasse 2'!K8=\"\",\"\",'Liste Klasse 2'!K8)","v":""},{"$f":"IF('Liste Klasse 2'!L8=\"\",\"\",'Liste Klasse 2'!L8)","v":""},{"$f":"IF('Liste Klasse 2'!M8=\"\",\"\",'Liste Klasse 2'!M8)","v":""},{"$f":"IF('Liste Klasse 2'!N8=\"\",\"\",'Liste Klasse 2'!N8)","v":""},{"$f":"IF('Liste Klasse 2'!O8=\"\",\"\",'Liste Klasse 2'!O8)","v":""},{"$f":"IF('Liste Klasse 2'!P8=\"\",\"\",'Liste Klasse 2'!P8)","v":""},{"$f":"IF('Liste Klasse 2'!Q8=\"\",\"\",'Liste Klasse 2'!Q8)","v":""},{"$f":"IF('Liste Klasse 2'!R8=\"\",\"\",'Liste Klasse 2'!R8)","v":""},{"$f":"'Liste Klasse 2'!S8","v":0},{"$f":"'Liste Klasse 2'!T8","v":""},{"$f":"'Liste Klasse 2'!U8","v":0}]
[{"$f":"IF('Liste Klasse 2'!A9=\"\",\"\",'Liste Klasse 2'!A9&\" / \"&'Liste Klasse 2'!B9&\" / Klasse 2\")","v":""},{"$f":"IF('Liste Klasse 2'!C9=\"\",\"\",'Liste Klasse 2'!C9)","v":""},{"$f":"IF('Liste Klasse 2'!D9=\"\",\"\",'Liste Klasse 2'!D9)","v":""},{"$f":"IF('Liste Klasse 2'!E9=\"\",\"\",'Liste Klasse 2'!E9)","v":""},{"$f":"IF('Liste Klasse 2'!F9=\"\",\"\",'Liste Klasse 2'!F9)","v":""},{"$f":"IF('Liste Klasse 2'!G9=\"\",\"\",'Liste Klasse 2'!G9)","v":""},{"$f":"IF('Liste Klasse 2'!H9=\"\",\"\",'Liste Klasse 2'!H9)","v":""},{"$f":"IF('Liste Klasse 2'!I9=\"\",\"\",'Liste Klasse 2'!I9)","v":""},{"$f":"IF('Liste Klasse 2'!J9=\"\",\"\",'Liste Klasse 2'!J9)","v":""},{"$f":"IF('Liste Klasse 2'!K9=\"\",\"\",'Liste Klasse 2'!K9)","v":""},{"$f":"IF('Liste Klasse 2'!L9=\"\",\"\",'Liste Klasse 2'!L9)","v":""},{"$f":"IF('Liste Klasse 2'!M9=\"\",\"\",'Liste Klasse 2'!M9)","v":""},{"$f":"IF('Liste Klasse 2'!N9=\"\",\"\",'Liste Klasse 2'!N9)","v":""},{"$f":"IF('Liste Klasse 2'!O9=\"\",\"\",'Liste Klasse 2'!O9)","v":""},{"$f":"IF('Liste Klasse 2'!P9=\"\",\"\",'Liste Klasse 2'!P9)","v":""},{"$f":"IF('Liste Klasse 2'!Q9=\"\",\"\",'Liste Klasse 2'!Q9)","v":""},{"$f":"IF('Liste Klasse 2'!R9=\"\",\"\",'Liste Klasse 2'!R9)","v":""},{"$f":"'Liste Klasse 2'!S9","v":0},{"$f":"'Liste Klasse 2'!T9","v":""},{"$f":"'Liste Klasse 2'!U9","v":0}]
[{"$f":"IF('Liste Klasse 2'!A10=\"\",\"\",'Liste Klasse 2'!A10&\" / \"&'Liste Klasse 2'!B10&\" / Klasse 2\")","v":""},{"$f":"IF('Liste Klasse 2'!C10=\"\",\"\",'Liste Klasse 2'!C10)","v":""},{"$f":"IF('Liste Klasse 2'!D10=\"\",\"\",'Liste Klasse 2'!D10)","v":""},{"$f":"IF('Liste Klasse 2'!E10=\"\",\"\",'Liste Klasse 2'!E10)","v":""},{"$f":"IF('Liste Klasse 2'!F10=\"\",\"\",'Liste Klasse 2'!F10)","v":""},{"$f":"IF('Liste Klasse 2'!G10=\"\",\"\",'Liste Klasse 2'!G10)","v":""},{"$f":"IF('Liste Klasse 2'!H10=\"\",\"\",'Liste Klasse 2'!H10)","v":""},{"$f":"IF('Liste Klasse 2'!I10=\"\",\"\",'Liste Klasse 2'!I10)","v":""},{"$f":"IF('Liste Klasse 2'!J10=\"\",\"\",'Liste Klasse 2'!J10)","v":""},{"$f":"IF('Liste Klasse 2'!K10=\"\",\"\",'Liste Klasse 2'!K10)","v":""},{"$f":"IF('Liste Klasse 2'!L10=\"\",\"\",'Liste Klasse 2'!L10)","v":""},{"$f":"IF('Liste Klasse 2'!M10=\"\",\"\",'Liste Klasse 2'!M10)","v":""},{"$f":"IF('Liste Klasse 2'!N10=\"\",\"\",'Liste Klasse 2'!N10)","v":""},{"$f":"IF('Liste Klasse 2'!O10=\"\",\"\",'Liste Klasse 2'!O10)","v":""},{"$f":"IF('Liste Klasse 2'!P10=\"\",\"\",'Liste Klasse 2'!P10)","v":""},{"$f":"IF('Liste Klasse 2'!Q10=\"\",\"\",'Liste Klasse 2'!Q10)","v":""},{"$f":"IF('Liste Klasse 2'!R10=\"\",\"\",'Liste Klasse 2'!R10)","v":""},{"$f":"'Liste Klasse 2'!S10","v":0},{"$f":"'Liste Klasse 2'!T10","v":""},{"$f":"'Liste Klasse 2'!U10","v":0}]
[{"$f":"IF('Liste Klasse 2'!A11=\"\",\"\",'Liste Klasse 2'!A11&\" / \"&'Liste Klasse 2'!B11&\" / Klasse 2\")","v":""},{"$f":"IF('Liste Klasse 2'!C11=\"\",\"\",'Liste Klasse 2'!C11)","v":""},{"$f":"IF('Liste Klasse 2'!D11=\"\",\"\",'Liste Klasse 2'!D11)","v":""},{"$f":"IF('Liste Klasse 2'!E11=\"\",\"\",'Liste Klasse 2'!E11)","v":""},{"$f":"IF('Liste Klasse 2'!F11=\"\",\"\",'Liste Klasse 2'!F11)","v":""},{"$f":"IF('Liste Klasse 2'!G11=\"\",\"\",'Liste Klasse 2'!G11)","v":""},{"$f":"IF('Liste Klasse 2'!H11=\"\",\"\",'Liste Klasse 2'!H11)","v":""},{"$f":"IF('Liste Klasse 2'!I11=\"\",\"\",'Liste Klasse 2'!I11)","v":""},{"$f":"IF('Liste Klasse 2'!J11=\"\",\"\",'Liste Klasse 2'!J11)","v":""},{"$f":"IF('Liste Klasse 2'!K11=\"\",\"\",'Liste Klasse 2'!K11)","v":""},{"$f":"IF('Liste Klasse 2'!L11=\"\",\"\",'Liste Klasse 2'!L11)","v":""},{"$f":"IF('Liste Klasse 2'!M11=\"\",\"\",'Liste Klasse 2'!M11)","v":""},{"$f":"IF('Liste Klasse 2'!N11=\"\",\"\",'Liste Klasse 2'!N11)","v":""},{"$f":"IF('Liste Klasse 2'!O11=\"\",\"\",'Liste Klasse 2'!O11)","v":""},{"$f":"IF('Liste Klasse 2'!P11=\"\",\"\",'Liste Klasse 2'!P11)","v":""},{"$f":"IF('Liste Klasse 2'!Q11=\"\",\"\",'Liste Klasse 2'!Q11)","v":""},{"$f":"IF('Liste Klasse 2'!R11=\"\",\"\",'Liste Klasse 2'!R11)","v":""},{"$f":"'Liste Klasse 2'!S11","v":0},{"$f":"'Liste Klasse 2'!T11","v":""},{"$f":"'Liste Klasse 2'!U11","v":0}]
[{"$f":"IF('Liste Klasse 2'!A12=\"\",\"\",'Liste Klasse 2'!A12&\" / \"&'Liste Klasse 2'!B12&\" / Klasse 2\")","v":""},{"$f":"IF('Liste Klasse 2'!C12=\"\",\"\",'Liste Klasse 2'!C12)","v":""},{"$f":"IF('Liste Klasse 2'!D12=\"\",\"\",'Liste Klasse 2'!D12)","v":""},{"$f":"IF('Liste Klasse 2'!E12=\"\",\"\",'Liste Klasse 2'!E12)","v":""},{"$f":"IF('Liste Klasse 2'!F12=\"\",\"\",'Liste Klasse 2'!F12)","v":""},{"$f":"IF('Liste Klasse 2'!G12=\"\",\"\",'Liste Klasse 2'!G12)","v":""},{"$f":"IF('Liste Klasse 2'!H12=\"\",\"\",'Liste Klasse 2'!H12)","v":""},{"$f":"IF('Liste Klasse 2'!I12=\"\",\"\",'Liste Klasse 2'!I12)","v":""},{"$f":"IF('Liste Klasse 2'!J12=\"\",\"\",'Liste Klasse 2'!J12)","v":""},{"$f":"IF('Liste Klasse 2'!K12=\"\",\"\",'Liste Klasse 2'!K12)","v":""},{"$f":"IF('Liste Klasse 2'!L12=\"\",\"\",'Liste Klasse 2'!L12)","v":""},{"$f":"IF('Liste Klasse 2'!M12=\"\",\"\",'Liste Klasse 2'!M12)","v":""},{"$f":"IF('Liste Klasse 2'!N12=\"\",\"\",'Liste Klasse 2'!N12)","v":""},{"$f":"IF('Liste Klasse 2'!O12=\"\",\"\",'Liste Klasse 2'!O12)","v":""},{"$f":"IF('Liste Klasse 2'!P12=\"\",\"\",'Liste Klasse 2'!P12)","v":""},{"$f":"IF('Liste Klasse 2'!Q12=\"\",\"\",'Liste Klasse 2'!Q12)","v":""},{"$f":"IF('Liste Klasse 2'!R12=\"\",\"\",'Liste Klasse 2'!R12)","v":""},{"$f":"'Liste Klasse 2'!S12","v":0},{"$f":"'Liste Klasse 2'!T12","v":""},{"$f":"'Liste Klasse 2'!U12","v":0}]
[{"$f":"IF('Liste Klasse 2'!A13=\"\",\"\",'Liste Klasse 2'!A13&\" / \"&'Liste Klasse 2'!B13&\" / Klasse 2\")","v":""},{"$f":"IF('Liste Klasse 2'!C13=\"\",\"\",'Liste Klasse 2'!C13)","v":""},{"$f":"IF('Liste Klasse 2'!D13=\"\",\"\",'Liste Klasse 2'!D13)","v":""},{"$f":"IF('Liste Klasse 2'!E13=\"\",\"\",'Liste Klasse 2'!E13)","v":""},{"$f":"IF('Liste Klasse 2'!F13=\"\",\"\",'Liste Klasse 2'!F13)","v":""},{"$f":"IF('Liste Klasse 2'!G13=\"\",\"\",'Liste Klasse 2'!G13)","v":""},{"$f":"IF('Liste Klasse 2'!H13=\"\",\"\",'Liste Klasse 2'!H13)","v":""},{"$f":"IF('Liste Klasse 2'!I13=\"\",\"\",'Liste Klasse 2'!I13)","v":""},{"$f":"IF('Liste Klasse 2'!J13=\"\",\"\",'Liste Klasse 2'!J13)","v":""},{"$f":"IF('Liste Klasse 2'!K13=\"\",\"\",'Liste Klasse 2'!K13)","v":""},{"$f":"IF('Liste Klasse 2'!L13=\"\",\"\",'Liste Klasse 2'!L13)","v":""},{"$f":"IF('Liste Klasse 2'!M13=\"\",\"\",'Liste Klasse 2'!M13)","v":""},{"$f":"IF('Liste Klasse 2'!N13=\"\",\"\",'Liste Klasse 2'!N13)","v":""},{"$f":"IF('Liste Klasse 2'!O13=\"\",\"\",'Liste Klasse 2'!O13)","v":""},{"$f":"IF('Liste Klasse 2'!P13=\"\",\"\",'Liste Klasse 2'!P13)","v":""},{"$f":"IF('Liste Klasse 2'!Q13=\"\",\"\",'Liste Klasse 2'!Q13)","v":""},{"$f":"IF('Liste Klasse 2'!R13=\"\",\"\",'Liste Klasse 2'!R13)","v":""},{"$f":"'Liste Klasse 2'!S13","v":0},{"$f":"'Liste Klasse 2'!T13","v":""},{"$f":"'Liste Klasse 2'!U13","v":0}]
[{"$f":"IF('Liste Klasse 2'!A14=\"\",\"\",'Liste Klasse 2'!A14&\" / \"&'Liste Klasse 2'!B14&\" / Klasse 2\")","v":""},{"$f":"IF('Liste Klasse 2'!C14=\"\",\"\",'Liste Klasse 2'!C14)","v":""},{"$f":"IF('Liste Klasse 2'!D14=\"\",\"\",'Liste Klasse 2'!D14)","v":""},{"$f":"IF('Liste Klasse 2'!E14=\"\",\"\",'Liste Klasse 2'!E14)","v":""},{"$f":"IF('Liste Klasse 2'!F14=\"\",\"\",'Liste Klasse 2'!F14)","v":""},{"$f":"IF('Liste Klasse 2'!G14=\"\",\"\",'Liste Klasse 2'!G14)","v":""},{"$f":"IF('Liste Klasse 2'!H14=\"\",\"\",'Liste Klasse 2'!H14)","v":""},{"$f":"IF('Liste Klasse 2'!I14=\"\",\"\",'Liste Klasse 2'!I14)","v":""},{"$f":"IF('Liste Klasse 2'!J14=\"\",\"\",'Liste Klasse 2'!J14)","v":""},{"$f":"IF('Liste Klasse 2'!K14=\"\",\"\",'Liste Klasse 2'!K14)","v":""},{"$f":"IF('Liste Klasse 2'!L14=\"\",\"\",'Liste Klasse 2'!L14)","v":""},{"$f":"IF('Liste Klasse 2'!M14=\"\",\"\",'Liste Klasse 2'!M14)","v":""},{"$f":"IF('Liste Klasse 2'!N14=\"\",\"\",'Liste Klasse 2'!N14)","v":""},{"$f":"IF('Liste Klasse 2'!O14=\"\",\"\",'Liste Klasse 2'!O14)","v":""},{"$f":"IF('Liste Klasse 2'!P14=\"\",\"\",'Liste Klasse 2'!P14)","v":""},{"$f":"IF('Liste Klasse 2'!Q14=\"\",\"\",'Liste Klasse 2'!Q14)","v":""},{"$f":"IF('Liste Klasse 2'!R14=\"\",\"\",'Liste Klasse 2'!R14)","v":""},{"$f":"'Liste Klasse 2'!S14","v":0},{"$f":"'Liste Klasse 2'!T14","v":""},{"$f":"'Liste Klasse 2'!U14","v":0}]
[{"$f":"IF('Liste Klasse 2'!A15=\"\",\"\",'Liste Klasse 2'!A15&\" / \"&'Liste Klasse 2'!B15&\" / Klasse 2\")","v":""},{"$f":"IF('Liste Klasse 2'!C15=\"\",\"\",'Liste Klasse 2'!C15)","v":""},{"$f":"IF('Liste Klasse 2'!D15=\"\",\"\",'Liste Klasse 2'!D15)","v":""},{"$f":"IF('Liste Klasse 2'!E15=\"\",\"\",'Liste Klasse 2'!E15)","v":""},{"$f":"IF('Liste Klasse 2'!F15=\"\",\"\",'Liste Klasse 2'!F15)","v":""},{"$f":"IF('Liste Klasse 2'!G15=\"\",\"\",'Liste Klasse 2'!G15)","v":""},{"$f":"IF('Liste Klasse 2'!H15=\"\",\"\",'Liste Klasse 2'!H15)","v":""},{"$f":"IF('Liste Klasse 2'!I15=\"\",\"\",'Liste Klasse 2'!I15)","v":""},{"$f":"IF('Liste Klasse 2'!J15=\"\",\"\",'Liste Klasse 2'!J15)","v":""},{"$f":"IF('Liste Klasse 2'!K15=\"\",\"\",'Liste Klasse 2'!K15)","v":""},{"$f":"IF('Liste Klasse 2'!L15=\"\",\"\",'Liste Klasse 2'!L15)","v":""},{"$f":"IF('Liste Klasse 2'!M15=\"\",\"\",'Liste Klasse 2'!M15)","v":""},{"$f":"IF('Liste Klasse 2'!N15=\"\",\"\",'Liste Klasse 2'!N15)","v":""},{"$f":"IF('Liste Klasse 2'!O15=\"\",\"\",'Liste Klasse 2'!O15)","v":""},{"$f":"IF('Liste Klasse 2'!P15=\"\",\"\",'Liste Klasse 2'!P15)","v":""},{"$f":"IF('Liste Klasse 2'!Q15=\"\",\"\",'Liste Klasse 2'!Q15)","v":""},{"$f":"IF('Liste Klasse 2'!R15=\"\",\"\",'Liste Klasse 2'!R15)","v":""},{"$f":"'Liste Klasse 2'!S15","v":0},{"$f":"'Liste Klasse 2'!T15","v":""},{"$f":"'Liste Klasse 2'!U15","v":0}]
[{"$f":"IF('Liste Klasse 2'!A16=\"\",\"\",'Liste Klasse 2'!A16&\" / \"&'Liste Klasse 2'!B16&\" / Klasse 2\")","v":""},{"$f":"IF('Liste Klasse 2'!C16=\"\",\"\",'Liste Klasse 2'!C16)","v":""},{"$f":"IF('Liste Klasse 2'!D16=\"\",\"\",'Liste Klasse 2'!D16)","v":""},{"$f":"IF('Liste Klasse 2'!E16=\"\",\"\",'Liste Klasse 2'!E16)","v":""},{"$f":"IF('Liste Klasse 2'!F16=\"\",\"\",'Liste Klasse 2'!F16)","v":""},{"$f":"IF('Liste Klasse 2'!G16=\"\",\"\",'Liste Klasse 2'!G16)","v":""},{"$f":"IF('Liste Klasse 2'!H16=\"\",\"\",'Liste Klasse 2'!H16)","v":""},{"$f":"IF('Liste Klasse 2'!I16=\"\",\"\",'Liste Klasse 2'!I16)","v":""},{"$f":"IF('Liste Klasse 2'!J16=\"\",\"\",'Liste Klasse 2'!J16)","v":""},{"$f":"IF('Liste Klasse 2'!K16=\"\",\"\",'Liste Klasse 2'!K16)","v":""},{"$f":"IF('Liste Klasse 2'!L16=\"\",\"\",'Liste Klasse 2'!L16)","v":""},{"$f":"IF('Liste Klasse 2'!M16=\"\",\"\",'Liste Klasse 2'!M16)","v":""},{"$f":"IF('Liste Klasse 2'!N16=\"\",\"\",'Liste Klasse 2'!N16)","v":""},{"$f":"IF('Liste Klasse 2'!O16=\"\",\"\",'Liste Klasse 2'!O16)","v":""},{"$f":"IF('Liste Klasse 2'!P16=\"\",\"\",'Liste Klasse 2'!P16)","v":""},{"$f":"IF('Liste Klasse 2'!Q16=\"\",\"\",'Liste Klasse 2'!Q16)","v":""},{"$f":"IF('Liste Klasse 2'!R16=\"\",\"\",'Liste Klasse 2'!R16)","v":""},{"$f":"'Liste Klasse 2'!S16","v":0},{"$f":"'Liste Klasse 2'!T16","v":""},{"$f":"'Liste Klasse 2'!U16","v":0}]
[{"$f":"IF('Liste Klasse 2'!A17=\"\",\"\",'Liste Klasse 2'!A17&\" / \"&'Liste Klasse 2'!B17&\" / Klasse 2\")","v":""},{"$f":"IF('Liste Klasse 2'!C17=\"\",\"\",'Liste Klasse 2'!C17)","v":""},{"$f":"IF('Liste Klasse 2'!D17=\"\",\"\",'Liste Klasse 2'!D17)","v":""},{"$f":"IF('Liste Klasse 2'!E17=\"\",\"\",'Liste Klasse 2'!E17)","v":""},{"$f":"IF('Liste Klasse 2'!F17=\"\",\"\",'Liste Klasse 2'!F17)","v":""},{"$f":"IF('Liste Klasse 2'!G17=\"\",\"\",'Liste Klasse 2'!G17)","v":""},{"$f":"IF('Liste Klasse 2'!H17=\"\",\"\",'Liste Klasse 2'!H17)","v":""},{"$f":"IF('Liste Klasse 2'!I17=\"\",\"\",'Liste Klasse 2'!I17)","v":""},{"$f":"IF('Liste Klasse 2'!J17=\"\",\"\",'Liste Klasse 2'!J17)","v":""},{"$f":"IF('Liste Klasse 2'!K17=\"\",\"\",'Liste Klasse 2'!K17)","v":""},{"$f":"IF('Liste Klasse 2'!L17=\"\",\"\",'Liste Klasse 2'!L17)","v":""},{"$f":"IF('Liste Klasse 2'!M17=\"\",\"\",'Liste Klasse 2'!M17)","v":""},{"$f":"IF('Liste Klasse 2'!N17=\"\",\"\",'Liste Klasse 2'!N17)","v":""},{"$f":"IF('Liste Klasse 2'!O17=\"\",\"\",'Liste Klasse 2'!O17)","v":""},{"$f":"IF('Liste Klasse 2'!P17=\"\",\"\",'Liste Klasse 2'!P17)","v":""},{"$f":"IF('Liste Klasse 2'!Q17=\"\",\"\",'Liste Klasse 2'!Q17)","v":""},{"$f":"IF('Liste Klasse 2'!R17=\"\",\"\",'Liste Klasse 2'!R17)","v":""},{"$f":"'Liste Klasse 2'!S17","v":0},{"$f":"'Liste Klasse 2'!T17","v":""},{"$f":"'Liste Klasse 2'!U17","v":0}]
[{"$f":"IF('Liste Klasse 2'!A18=\"\",\"\",'Liste Klasse 2'!A18&\" / \"&'Liste Klasse 2'!B18&\" / Klasse 2\")","v":""},{"$f":"IF('Liste Klasse 2'!C18=\"\",\"\",'Liste Klasse 2'!C18)","v":""},{"$f":"IF('Liste Klasse 2'!D18=\"\",\"\",'Liste Klasse 2'!D18)","v":""},{"$f":"IF('Liste Klasse 2'!E18=\"\",\"\",'Liste Klasse 2'!E18)","v":""},{"$f":"IF('Liste Klasse 2'!F18=\"\",\"\",'Liste Klasse 2'!F18)","v":""},{"$f":"IF('Liste Klasse 2'!G18=\"\",\"\",'Liste Klasse 2'!G18)","v":""},{"$f":"IF('Liste Klasse 2'!H18=\"\",\"\",'Liste Klasse 2'!H18)","v":""},{"$f":"IF('Liste Klasse 2'!I18=\"\",\"\",'Liste Klasse 2'!I18)","v":""},{"$f":"IF('Liste Klasse 2'!J18=\"\",\"\",'Liste Klasse 2'!J18)","v":""},{"$f":"IF('Liste Klasse 2'!K18=\"\",\"\",'Liste Klasse 2'!K18)","v":""},{"$f":"IF('Liste Klasse 2'!L18=\"\",\"\",'Liste Klasse 2'!L18)","v":""},{"$f":"IF('Liste Klasse 2'!M18=\"\",\"\",'Liste Klasse 2'!M18)","v":""},{"$f":"IF('Liste Klasse 2'!N18=\"\",\"\",'Liste Klasse 2'!N18)","v":""},{"$f":"IF('Liste Klasse 2'!O18=\"\",\"\",'Liste Klasse 2'!O18)","v":""},{"$f":"IF('Liste Klasse 2'!P18=\"\",\"\",'Liste Klasse 2'!P18)","v":""},{"$f":"IF('Liste Klasse 2'!Q18=\"\",\"\",'Liste Klasse 2'!Q18)","v":""},{"$f":"IF('Liste Klasse 2'!R18=\"\",\"\",'Liste Klasse 2'!R18)","v":""},{"$f":"'Liste Klasse 2'!S18","v":0},{"$f":"'Liste Klasse 2'!T18","v":""},{"$f":"'Liste Klasse 2'!U18","v":0}]
[{"$f":"IF('Liste Klasse 2'!A19=\"\",\"\",'Liste Klasse 2'!A19&\" / \"&'Liste Klasse 2'!B19&\" / Klasse 2\")","v":""},{"$f":"IF('Liste Klasse 2'!C19=\"\",\"\",'Liste Klasse 2'!C19)","v":""},{"$f":"IF('Liste Klasse 2'!D19=\"\",\"\",'Liste Klasse 2'!D19)","v":""},{"$f":"IF('Liste Klasse 2'!E19=\"\",\"\",'Liste Klasse 2'!E19)","v":""},{"$f":"IF('Liste Klasse 2'!F19=\"\",\"\",'Liste Klasse 2'!F19)","v":""},{"$f":"IF('Liste Klasse 2'!G19=\"\",\"\",'Liste Klasse 2'!G19)","v":""},{"$f":"IF('Liste Klasse 2'!H19=\"\",\"\",'Liste Klasse 2'!H19)","v":""},{"$f":"IF('Liste Klasse 2'!I19=\"\",\"\",'Liste Klasse 2'!I19)","v":""},{"$f":"IF('Liste Klasse 2'!J19=\"\",\"\",'Liste Klasse 2'!J19)","v":""},{"$f":"IF('Liste Klasse 2'!K19=\"\",\"\",'Liste Klasse 2'!K19)","v":""},{"$f":"IF('Liste Klasse 2'!L19=\"\",\"\",'Liste Klasse 2'!L19)","v":""},{"$f":"IF('Liste Klasse 2'!M19=\"\",\"\",'Liste Klasse 2'!M19)","v":""},{"$f":"IF('Liste Klasse 2'!N19=\"\",\"\",'Liste Klasse 2'!N19)","v":""},{"$f":"IF('Liste Klasse 2'!O19=\"\",\"\",'Liste Klasse 2'!O19)","v":""},{"$f":"IF('Liste Klasse 2'!P19=\"\",\"\",'Liste Klasse 2'!P19)","v":""},{"$f":"IF('Liste Klasse 2'!Q19=\"\",\"\",'Liste Klasse 2'!Q19)","v":""},{"$f":"IF('Liste Klasse 2'!R19=\"\",\"\",'Liste Klasse 2'!R19)","v":""},{"$f":"'Liste Klasse 2'!S19","v":0},{"$f":"'Liste Klasse 2'!T19","v":""},{"$f":"'Liste Klasse 2'!U19","v":0}]
[{"$f":"IF('Liste Klasse 2'!A20=\"\",\"\",'Liste Klasse 2'!A20&\" / \"&'Liste Klasse 2'!B20&\" / Klasse 2\")","v":""},{"$f":"IF('Liste Klasse 2'!C20=\"\",\"\",'Liste Klasse 2'!C20)","v":""},{"$f":"IF('Liste Klasse 2'!D20=\"\",\"\",'Liste Klasse 2'!D20)","v":""},{"$f":"IF('Liste Klasse 2'!E20=\"\",\"\",'Liste Klasse 2'!E20)","v":""},{"$f":"IF('Liste Klasse 2'!F20=\"\",\"\",'Liste Klasse 2'!F20)","v":""},{"$f":"IF('Liste Klasse 2'!G20=\"\",\"\",'Liste Klasse 2'!G20)","v":""},{"$f":"IF('Liste Klasse 2'!H20=\"\",\"\",'Liste Klasse 2'!H20)","v":""},{"$f":"IF('Liste Klasse 2'!I20=\"\",\"\",'Liste Klasse 2'!I20)","v":""},{"$f":"IF('Liste Klasse 2'!J20=\"\",\"\",'Liste Klasse 2'!J20)","v":""},{"$f":"IF('Liste Klasse 2'!K20=\"\",\"\",'Liste Klasse 2'!K20)","v":""},{"$f":"IF('Liste Klasse 2'!L20=\"\",\"\",'Liste Klasse 2'!L20)","v":""},{"$f":"IF('Liste Klasse 2'!M20=\"\",\"\",'Liste Klasse 2'!M20)","v":""},{"$f":"IF('Liste Klasse 2'!N20=\"\",\"\",'Liste Klasse 2'!N20)","v":""},{"$f":"IF('Liste Klasse 2'!O20=\"\",\"\",'Liste Klasse 2'!O20)","v":""},{"$f":"IF('Liste Klasse 2'!P20=\"\",\"\",'Liste Klasse 2'!P20)","v":""},{"$f":"IF('Liste Klasse 2'!Q20=\"\",\"\",'Liste Klasse 2'!Q20)","v":""},{"$f":"IF('Liste Klasse 2'!R20=\"\",\"\",'Liste Klasse 2'!R20)","v":""},{"$f":"'Liste Klasse 2'!S20","v":0},{"$f":"'Liste Klasse 2'!T20","v":""},{"$f":"'Liste Klasse 2'!U20","v":0}]
[{"$f":"IF('Liste Klasse 2'!A21=\"\",\"\",'Liste Klasse 2'!A21&\" / \"&'Liste Klasse 2'!B21&\" / Klasse 2\")","v":""},{"$f":"IF('Liste Klasse 2'!C21=\"\",\"\",'Liste Klasse 2'!C21)","v":""},{"$f":"IF('Liste Klasse 2'!D21=\"\",\"\",'Liste Klasse 2'!D21)","v":""},{"$f":"IF('Liste Klasse 2'!E21=\"\",\"\",'Liste Klasse 2'!E21)","v":""},{"$f":"IF('Liste Klasse 2'!F21=\"\",\"\",'Liste Klasse 2'!F21)","v":""},{"$f":"IF('Liste Klasse 2'!G21=\"\",\"\",'Liste Klasse 2'!G21)","v":""},{"$f":"IF('Liste Klasse 2'!H21=\"\",\"\",'Liste Klasse 2'!H21)","v":""},{"$f":"IF('Liste Klasse 2'!I21=\"\",\"\",'Liste Klasse 2'!I21)","v":""},{"$f":"IF('Liste Klasse 2'!J21=\"\",\"\",'Liste Klasse 2'!J21)","v":""},{"$f":"IF('Liste Klasse 2'!K21=\"\",\"\",'Liste Klasse 2'!K21)","v":""},{"$f":"IF('Liste Klasse 2'!L21=\"\",\"\",'Liste Klasse 2'!L21)","v":""},{"$f":"IF('Liste Klasse 2'!M21=\"\",\"\",'Liste Klasse 2'!M21)","v":""},{"$f":"IF('Liste Klasse 2'!N21=\"\",\"\",'Liste Klasse 2'!N21)","v":""},{"$f":"IF('Liste Klasse 2'!O21=\"\",\"\",'Liste Klasse 2'!O21)","v":""},{"$f":"IF('Liste Klasse 2'!P21=\"\",\"\",'Liste Klasse 2'!P21)","v":""},{"$f":"IF('Liste Klasse 2'!Q21=\"\",\"\",'Liste Klasse 2'!Q21)","v":""},{"$f":"IF('Liste Klasse 2'!R21=\"\",\"\",'Liste Klasse 2'!R21)","v":""},{"$f":"'Liste Klasse 2'!S21","v":0},{"$f":"'Liste Klasse 2'!T21","v":""},{"$f":"'Liste Klasse 2'!U21","v":0}]
[{"$f":"IF('Liste Klasse 2'!A22=\"\",\"\",'Liste Klasse 2'!A22&\" / \"&'Liste Klasse 2'!B22&\" / Klasse 2\")","v":""},{"$f":"IF('Liste Klasse 2'!C22=\"\",\"\",'Liste Klasse 2'!C22)","v":""},{"$f":"IF('Liste Klasse 2'!D22=\"\",\"\",'Liste Klasse 2'!D22)","v":""},{"$f":"IF('Liste Klasse 2'!E22=\"\",\"\",'Liste Klasse 2'!E22)","v":""},{"$f":"IF('Liste Klasse 2'!F22=\"\",\"\",'Liste Klasse 2'!F22)","v":""},{"$f":"IF('Liste Klasse 2'!G22=\"\",\"\",'Liste Klasse 2'!G22)","v":""},{"$f":"IF('Liste Klasse 2'!H22=\"\",\"\",'Liste Klasse 2'!H22)","v":""},{"$f":"IF('Liste Klasse 2'!I22=\"\",\"\",'Liste Klasse 2'!I22)","v":""},{"$f":"IF('Liste Klasse 2'!J22=\"\",\"\",'Liste Klasse 2'!J22)","v":""},{"$f":"IF('Liste Klasse 2'!K22=\"\",\"\",'Liste Klasse 2'!K22)","v":""},{"$f":"IF('Liste Klasse 2'!L22=\"\",\"\",'Liste Klasse 2'!L22)","v":""},{"$f":"IF('Liste Klasse 2'!M22=\"\",\"\",'Liste Klasse 2'!M22)","v":""},{"$f":"IF('Liste Klasse 2'!N22=\"\",\"\",'Liste Klasse 2'!N22)","v":""},{"$f":"IF('Liste Klasse 2'!O22=\"\",\"\",'Liste Klasse 2'!O22)","v":""},{"$f":"IF('Liste Klasse 2'!P22=\"\",\"\",'Liste Klasse 2'!P22)","v":""},{"$f":"IF('Liste Klasse 2'!Q22=\"\",\"\",'Liste Klasse 2'!Q22)","v":""},{"$f":"IF('Liste Klasse 2'!R22=\"\",\"\",'Liste Klasse 2'!R22)","v":""},{"$f":"'Liste Klasse 2'!S22","v":0},{"$f":"'Liste Klasse 2'!T22","v":""},{"$f":"'Liste Klasse 2'!U22","v":0}]
[{"$f":"IF('Liste Klasse 2'!A23=\"\",\"\",'Liste Klasse 2'!A23&\" / \"&'Liste Klasse 2'!B23&\" / Klasse 2\")","v":""},{"$f":"IF('Liste Klasse 2'!C23=\"\",\"\",'Liste Klasse 2'!C23)","v":""},{"$f":"IF('Liste Klasse 2'!D23=\"\",\"\",'Liste Klasse 2'!D23)","v":""},{"$f":"IF('Liste Klasse 2'!E23=\"\",\"\",'Liste Klasse 2'!E23)","v":""},{"$f":"IF('Liste Klasse 2'!F23=\"\",\"\",'Liste Klasse 2'!F23)","v":""},{"$f":"IF('Liste Klasse 2'!G23=\"\",\"\",'Liste Klasse 2'!G23)","v":""},{"$f":"IF('Liste Klasse 2'!H23=\"\",\"\",'Liste Klasse 2'!H23)","v":""},{"$f":"IF('Liste Klasse 2'!I23=\"\",\"\",'Liste Klasse 2'!I23)","v":""},{"$f":"IF('Liste Klasse 2'!J23=\"\",\"\",'Liste Klasse 2'!J23)","v":""},{"$f":"IF('Liste Klasse 2'!K23=\"\",\"\",'Liste Klasse 2'!K23)","v":""},{"$f":"IF('Liste Klasse 2'!L23=\"\",\"\",'Liste Klasse 2'!L23)","v":""},{"$f":"IF('Liste Klasse 2'!M23=\"\",\"\",'Liste Klasse 2'!M23)","v":""},{"$f":"IF('Liste Klasse 2'!N23=\"\",\"\",'Liste Klasse 2'!N23)","v":""},{"$f":"IF('Liste Klasse 2'!O23=\"\",\"\",'Liste Klasse 2'!O23)","v":""},{"$f":"IF('Liste Klasse 2'!P23=\"\",\"\",'Liste Klasse 2'!P23)","v":""},{"$f":"IF('Liste Klasse 2'!Q23=\"\",\"\",'Liste Klasse 2'!Q23)","v":""},{"$f":"IF('Liste Klasse 2'!R23=\"\",\"\",'Liste Klasse 2'!R23)","v":""},{"$f":"'Liste Klasse 2'!S23","v":0},{"$f":"'Liste Klasse 2'!T23","v":""},{"$f":"'Liste Klasse 2'!U23","v":0}]
[{"$f":"IF('Liste Klasse 2'!A24=\"\",\"\",'Liste Klasse 2'!A24&\" / \"&'Liste Klasse 2'!B24&\" / Klasse 2\")","v":""},{"$f":"IF('Liste Klasse 2'!C24=\"\",\"\",'Liste Klasse 2'!C24)","v":""},{"$f":"IF('Liste Klasse 2'!D24=\"\",\"\",'Liste Klasse 2'!D24)","v":""},{"$f":"IF('Liste Klasse 2'!E24=\"\",\"\",'Liste Klasse 2'!E24)","v":""},{"$f":"IF('Liste Klasse 2'!F24=\"\",\"\",'Liste Klasse 2'!F24)","v":""},{"$f":"IF('Liste Klasse 2'!G24=\"\",\"\",'Liste Klasse 2'!G24)","v":""},{"$f":"IF('Liste Klasse 2'!H24=\"\",\"\",'Liste Klasse 2'!H24)","v":""},{"$f":"IF('Liste Klasse 2'!I24=\"\",\"\",'Liste Klasse 2'!I24)","v":""},{"$f":"IF('Liste Klasse 2'!J24=\"\",\"\",'Liste Klasse 2'!J24)","v":""},{"$f":"IF('Liste Klasse 2'!K24=\"\",\"\",'Liste Klasse 2'!K24)","v":""},{"$f":"IF('Liste Klasse 2'!L24=\"\",\"\",'Liste Klasse 2'!L24)","v":""},{"$f":"IF('Liste Klasse 2'!M24=\"\",\"\",'Liste Klasse 2'!M24)","v":""},{"$f":"IF('Liste Klasse 2'!N24=\"\",\"\",'Liste Klasse 2'!N24)","v":""},{"$f":"IF('Liste Klasse 2'!O24=\"\",\"\",'Liste Klasse 2'!O24)","v":""},{"$f":"IF('Liste Klasse 2'!P24=\"\",\"\",'Liste Klasse 2'!P24)","v":""},{"$f":"IF('Liste Klasse 2'!Q24=\"\",\"\",'Liste Klasse 2'!Q24)","v":""},{"$f":"IF('Liste Klasse 2'!R24=\"\",\"\",'Liste Klasse 2'!R24)","v":""},{"$f":"'Liste Klasse 2'!S24","v":0},{"$f":"'Liste Klasse 2'!T24","v":""},{"$f":"'Liste Klasse 2'!U24","v":0}]
[{"$f":"IF('Liste Klasse 2'!A25=\"\",\"\",'Liste Klasse 2'!A25&\" / \"&'Liste Klasse 2'!B25&\" / Klasse 2\")","v":""},{"$f":"IF('Liste Klasse 2'!C25=\"\",\"\",'Liste Klasse 2'!C25)","v":""},{"$f":"IF('Liste Klasse 2'!D25=\"\",\"\",'Liste Klasse 2'!D25)","v":""},{"$f":"IF('Liste Klasse 2'!E25=\"\",\"\",'Liste Klasse 2'!E25)","v":""},{"$f":"IF('Liste Klasse 2'!F25=\"\",\"\",'Liste Klasse 2'!F25)","v":""},{"$f":"IF('Liste Klasse 2'!G25=\"\",\"\",'Liste Klasse 2'!G25)","v":""},{"$f":"IF('Liste Klasse 2'!H25=\"\",\"\",'Liste Klasse 2'!H25)","v":""},{"$f":"IF('Liste Klasse 2'!I25=\"\",\"\",'Liste Klasse 2'!I25)","v":""},{"$f":"IF('Liste Klasse 2'!J25=\"\",\"\",'Liste Klasse 2'!J25)","v":""},{"$f":"IF('Liste Klasse 2'!K25=\"\",\"\",'Liste Klasse 2'!K25)","v":""},{"$f":"IF('Liste Klasse 2'!L25=\"\",\"\",'Liste Klasse 2'!L25)","v":""},{"$f":"IF('Liste Klasse 2'!M25=\"\",\"\",'Liste Klasse 2'!M25)","v":""},{"$f":"IF('Liste Klasse 2'!N25=\"\",\"\",'Liste Klasse 2'!N25)","v":""},{"$f":"IF('Liste Klasse 2'!O25=\"\",\"\",'Liste Klasse 2'!O25)","v":""},{"$f":"IF('Liste Klasse 2'!P25=\"\",\"\",'Liste Klasse 2'!P25)","v":""},{"$f":"IF('Liste Klasse 2'!Q25=\"\",\"\",'Liste Klasse 2'!Q25)","v":""},{"$f":"IF('Liste Klasse 2'!R25=\"\",\"\",'Liste Klasse 2'!R25)","v":""},{"$f":"'Liste Klasse 2'!S25","v":0},{"$f":"'Liste Klasse 2'!T25","v":""},{"$f":"'Liste Klasse 2'!U25","v":0}]
["Start / Los / Klasse","Hundeführer/-in","Verein","Verband","Hund","Rasse",{"$f":"IF('Liste Klasse 3'!H$4=0,\"\",'Liste Klasse 3'!H$4)","v":1},{"$f":"IF('Liste Klasse 3'!I$4=0,\"\",'Liste Klasse 3'!I$4)","v":2},{"$f":"IF('Liste Klasse 3'!J$4=0,\"\",'Liste Klasse 3'!J$4)","v":3},{"$f":"IF('Liste Klasse 3'!K$4=0,\"\",'Liste Klasse 3'!K$4)","v":4},{"$f":"IF('Liste Klasse 3'!L$4=0,\"\",'Liste Klasse 3'!L$4)","v":5},{"$f":"IF('Liste Klasse 3'!M$4=0,\"\",'Liste Klasse 3'!M$4)","v":6},{"$f":"IF('Liste Klasse 3'!N$4=0,\"\",'Liste Klasse 3'!N$4)","v":7},{"$f":"IF('Liste Klasse 3'!O$4=0,\"\",'Liste Klasse 3'!O$4)","v":8},{"$f":"IF('Liste Klasse 3'!P$4=0,\"\",'Liste Klasse 3'!P$4)","v":9},{"$f":"IF('Liste Klasse 3'!Q$4=0,\"\",'Liste Klasse 3'!Q$4)","v":10},"GK","Gesamt","WN","Platz"]
[{"$f":"IF('Liste Klasse 3'!A8=\"\",\"\",'Liste Klasse 3'!A8&\" / \"&'Liste Klasse 3'!B8&\" / Klasse 3\")","v":""},{"$f":"IF('Liste Klasse 3'!C8=\"\",\"\",'Liste Klasse 3'!C8)","v":""},{"$f":"IF('Liste Klasse 3'!D8=\"\",\"\",'Liste Klasse 3'!D8)","v":""},{"$f":"IF('Liste Klasse 3'!E8=\"\",\"\",'Liste Klasse 3'!E8)","v":""},{"$f":"IF('Liste Klasse 3'!F8=\"\",\"\",'Liste Klasse 3'!F8)","v":""},{"$f":"IF('Liste Klasse 3'!G8=\"\",\"\",'Liste Klasse 3'!G8)","v":""},{"$f":"IF('Liste Klasse 3'!H8=\"\",\"\",'Liste Klasse 3'!H8)","v":""},{"$f":"IF('Liste Klasse 3'!I8=\"\",\"\",'Liste Klasse 3'!I8)","v":""},{"$f":"IF('Liste Klasse 3'!J8=\"\",\"\",'Liste Klasse 3'!J8)","v":""},{"$f":"IF('Liste Klasse 3'!K8=\"\",\"\",'Liste Klasse 3'!K8)","v":""},{"$f":"IF('Liste Klasse 3'!L8=\"\",\"\",'Liste Klasse 3'!L8)","v":""},{"$f":"IF('Liste Klasse 3'!M8=\"\",\"\",'Liste Klasse 3'!M8)","v":""},{"$f":"IF('Liste Klasse 3'!N8=\"\",\"\",'Liste Klasse 3'!N8)","v":""},{"$f":"IF('Liste Klasse 3'!O8=\"\",\"\",'Liste Klasse 3'!O8)","v":""},{"$f":"IF('Liste Klasse 3'!P8=\"\",\"\",'Liste Klasse 3'!P8)","v":""},{"$f":"IF('Liste Klasse 3'!Q8=\"\",\"\",'Liste Klasse 3'!Q8)","v":""},{"$f":"IF('Liste Klasse 3'!R8=\"\",\"\",'Liste Klasse 3'!R8)","v":0},{"$f":"'Liste Klasse 3'!S8","v":0},{"$f":"'Liste Klasse 3'!T8","v":""},{"$f":"'Liste Klasse 3'!U8","v":0}]
[{"$f":"IF('Liste Klasse 3'!A9=\"\",\"\",'Liste Klasse 3'!A9&\" / \"&'Liste Klasse 3'!B9&\" / Klasse 3\")","v":""},{"$f":"IF('Liste Klasse 3'!C9=\"\",\"\",'Liste Klasse 3'!C9)","v":""},{"$f":"IF('Liste Klasse 3'!D9=\"\",\"\",'Liste Klasse 3'!D9)","v":""},{"$f":"IF('Liste Klasse 3'!E9=\"\",\"\",'Liste Klasse 3'!E9)","v":""},{"$f":"IF('Liste Klasse 3'!F9=\"\",\"\",'Liste Klasse 3'!F9)","v":""},{"$f":"IF('Liste Klasse 3'!G9=\"\",\"\",'Liste Klasse 3'!G9)","v":""},{"$f":"IF('Liste Klasse 3'!H9=\"\",\"\",'Liste Klasse 3'!H9)","v":""},{"$f":"IF('Liste Klasse 3'!I9=\"\",\"\",'Liste Klasse 3'!I9)","v":""},{"$f":"IF('Liste Klasse 3'!J9=\"\",\"\",'Liste Klasse 3'!J9)","v":""},{"$f":"IF('Liste Klasse 3'!K9=\"\",\"\",'Liste Klasse 3'!K9)","v":""},{"$f":"IF('Liste Klasse 3'!L9=\"\",\"\",'Liste Klasse 3'!L9)","v":""},{"$f":"IF('Liste Klasse 3'!M9=\"\",\"\",'Liste Klasse 3'!M9)","v":""},{"$f":"IF('Liste Klasse 3'!N9=\"\",\"\",'Liste Klasse 3'!N9)","v":""},{"$f":"IF('Liste Klasse 3'!O9=\"\",\"\",'Liste Klasse 3'!O9)","v":""},{"$f":"IF('Liste Klasse 3'!P9=\"\",\"\",'Liste Klasse 3'!P9)","v":""},{"$f":"IF('Liste Klasse 3'!Q9=\"\",\"\",'Liste Klasse 3'!Q9)","v":""},{"$f":"IF('Liste Klasse 3'!R9=\"\",\"\",'Liste Klasse 3'!R9)","v":0},{"$f":"'Liste Klasse 3'!S9","v":0},{"$f":"'Liste Klasse 3'!T9","v":""},{"$f":"'Liste Klasse 3'!U9","v":0}]
[{"$f":"IF('Liste Klasse 3'!A10=\"\",\"\",'Liste Klasse 3'!A10&\" / \"&'Liste Klasse 3'!B10&\" / Klasse 3\")","v":""},{"$f":"IF('Liste Klasse 3'!C10=\"\",\"\",'Liste Klasse 3'!C10)","v":""},{"$f":"IF('Liste Klasse 3'!D10=\"\",\"\",'Liste Klasse 3'!D10)","v":""},{"$f":"IF('Liste Klasse 3'!E10=\"\",\"\",'Liste Klasse 3'!E10)","v":""},{"$f":"IF('Liste Klasse 3'!F10=\"\",\"\",'Liste Klasse 3'!F10)","v":""},{"$f":"IF('Liste Klasse 3'!G10=\"\",\"\",'Liste Klasse 3'!G10)","v":""},{"$f":"IF('Liste Klasse 3'!H10=\"\",\"\",'Liste Klasse 3'!H10)","v":""},{"$f":"IF('Liste Klasse 3'!I10=\"\",\"\",'Liste Klasse 3'!I10)","v":""},{"$f":"IF('Liste Klasse 3'!J10=\"\",\"\",'Liste Klasse 3'!J10)","v":""},{"$f":"IF('Liste Klasse 3'!K10=\"\",\"\",'Liste Klasse 3'!K10)","v":""},{"$f":"IF('Liste Klasse 3'!L10=\"\",\"\",'Liste Klasse 3'!L10)","v":""},{"$f":"IF('Liste Klasse 3'!M10=\"\",\"\",'Liste Klasse 3'!M10)","v":""},{"$f":"IF('Liste Klasse 3'!N10=\"\",\"\",'Liste Klasse 3'!N10)","v":""},{"$f":"IF('Liste Klasse 3'!O10=\"\",\"\",'Liste Klasse 3'!O10)","v":""},{"$f":"IF('Liste Klasse 3'!P10=\"\",\"\",'Liste Klasse 3'!P10)","v":""},{"$f":"IF('Liste Klasse 3'!Q10=\"\",\"\",'Liste Klasse 3'!Q10)","v":""},{"$f":"IF('Liste Klasse 3'!R10=\"\",\"\",'Liste Klasse 3'!R10)","v":0},{"$f":"'Liste Klasse 3'!S10","v":0},{"$f":"'Liste Klasse 3'!T10","v":""},{"$f":"'Liste Klasse 3'!U10","v":0}]
[{"$f":"IF('Liste Klasse 3'!A11=\"\",\"\",'Liste Klasse 3'!A11&\" / \"&'Liste Klasse 3'!B11&\" / Klasse 3\")","v":""},{"$f":"IF('Liste Klasse 3'!C11=\"\",\"\",'Liste Klasse 3'!C11)","v":""},{"$f":"IF('Liste Klasse 3'!D11=\"\",\"\",'Liste Klasse 3'!D11)","v":""},{"$f":"IF('Liste Klasse 3'!E11=\"\",\"\",'Liste Klasse 3'!E11)","v":""},{"$f":"IF('Liste Klasse 3'!F11=\"\",\"\",'Liste Klasse 3'!F11)","v":""},{"$f":"IF('Liste Klasse 3'!G11=\"\",\"\",'Liste Klasse 3'!G11)","v":""},{"$f":"IF('Liste Klasse 3'!H11=\"\",\"\",'Liste Klasse 3'!H11)","v":""},{"$f":"IF('Liste Klasse 3'!I11=\"\",\"\",'Liste Klasse 3'!I11)","v":""},{"$f":"IF('Liste Klasse 3'!J11=\"\",\"\",'Liste Klasse 3'!J11)","v":""},{"$f":"IF('Liste Klasse 3'!K11=\"\",\"\",'Liste Klasse 3'!K11)","v":""},{"$f":"IF('Liste Klasse 3'!L11=\"\",\"\",'Liste Klasse 3'!L11)","v":""},{"$f":"IF('Liste Klasse 3'!M11=\"\",\"\",'Liste Klasse 3'!M11)","v":""},{"$f":"IF('Liste Klasse 3'!N11=\"\",\"\",'Liste Klasse 3'!N11)","v":""},{"$f":"IF('Liste Klasse 3'!O11=\"\",\"\",'Liste Klasse 3'!O11)","v":""},{"$f":"IF('Liste Klasse 3'!P11=\"\",\"\",'Liste Klasse 3'!P11)","v":""},{"$f":"IF('Liste Klasse 3'!Q11=\"\",\"\",'Liste Klasse 3'!Q11)","v":""},{"$f":"IF('Liste Klasse 3'!R11=\"\",\"\",'Liste Klasse 3'!R11)","v":0},{"$f":"'Liste Klasse 3'!S11","v":0},{"$f":"'Liste Klasse 3'!T11","v":""},{"$f":"'Liste Klasse 3'!U11","v":0}]
[{"$f":"IF('Liste Klasse 3'!A12=\"\",\"\",'Liste Klasse 3'!A12&\" / \"&'Liste Klasse 3'!B12&\" / Klasse 3\")","v":""},{"$f":"IF('Liste Klasse 3'!C12=\"\",\"\",'Liste Klasse 3'!C12)","v":""},{"$f":"IF('Liste Klasse 3'!D12=\"\",\"\",'Liste Klasse 3'!D12)","v":""},{"$f":"IF('Liste Klasse 3'!E12=\"\",\"\",'Liste Klasse 3'!E12)","v":""},{"$f":"IF('Liste Klasse 3'!F12=\"\",\"\",'Liste Klasse 3'!F12)","v":""},{"$f":"IF('Liste Klasse 3'!G12=\"\",\"\",'Liste Klasse 3'!G12)","v":""},{"$f":"IF('Liste Klasse 3'!H12=\"\",\"\",'Liste Klasse 3'!H12)","v":""},{"$f":"IF('Liste Klasse 3'!I12=\"\",\"\",'Liste Klasse 3'!I12)","v":""},{"$f":"IF('Liste Klasse 3'!J12=\"\",\"\",'Liste Klasse 3'!J12)","v":""},{"$f":"IF('Liste Klasse 3'!K12=\"\",\"\",'Liste Klasse 3'!K12)","v":""},{"$f":"IF('Liste Klasse 3'!L12=\"\",\"\",'Liste Klasse 3'!L12)","v":""},{"$f":"IF('Liste Klasse 3'!M12=\"\",\"\",'Liste Klasse 3'!M12)","v":""},{"$f":"IF('Liste Klasse 3'!N12=\"\",\"\",'Liste Klasse 3'!N12)","v":""},{"$f":"IF('Liste Klasse 3'!O12=\"\",\"\",'Liste Klasse 3'!O12)","v":""},{"$f":"IF('Liste Klasse 3'!P12=\"\",\"\",'Liste Klasse 3'!P12)","v":""},{"$f":"IF('Liste Klasse 3'!Q12=\"\",\"\",'Liste Klasse 3'!Q12)","v":""},{"$f":"IF('Liste Klasse 3'!R12=\"\",\"\",'Liste Klasse 3'!R12)","v":0},{"$f":"'Liste Klasse 3'!S12","v":0},{"$f":"'Liste Klasse 3'!T12","v":""},{"$f":"'Liste Klasse 3'!U12","v":0}]
[{"$f":"IF('Liste Klasse 3'!A13=\"\",\"\",'Liste Klasse 3'!A13&\" / \"&'Liste Klasse 3'!B13&\" / Klasse 3\")","v":""},{"$f":"IF('Liste Klasse 3'!C13=\"\",\"\",'Liste Klasse 3'!C13)","v":""},{"$f":"IF('Liste Klasse 3'!D13=\"\",\"\",'Liste Klasse 3'!D13)","v":""},{"$f":"IF('Liste Klasse 3'!E13=\"\",\"\",'Liste Klasse 3'!E13)","v":""},{"$f":"IF('Liste Klasse 3'!F13=\"\",\"\",'Liste Klasse 3'!F13)","v":""},{"$f":"IF('Liste Klasse 3'!G13=\"\",\"\",'Liste Klasse 3'!G13)","v":""},{"$f":"IF('Liste Klasse 3'!H13=\"\",\"\",'Liste Klasse 3'!H13)","v":""},{"$f":"IF('Liste Klasse 3'!I13=\"\",\"\",'Liste Klasse 3'!I13)","v":""},{"$f":"IF('Liste Klasse 3'!J13=\"\",\"\",'Liste Klasse 3'!J13)","v":""},{"$f":"IF('Liste Klasse 3'!K13=\"\",\"\",'Liste Klasse 3'!K13)","v":""},{"$f":"IF('Liste Klasse 3'!L13=\"\",\"\",'Liste Klasse 3'!L13)","v":""},{"$f":"IF('Liste Klasse 3'!M13=\"\",\"\",'Liste Klasse 3'!M13)","v":""},{"$f":"IF('Liste Klasse 3'!N13=\"\",\"\",'Liste Klasse 3'!N13)","v":""},{"$f":"IF('Liste Klasse 3'!O13=\"\",\"\",'Liste Klasse 3'!O13)","v":""},{"$f":"IF('Liste Klasse 3'!P13=\"\",\"\",'Liste Klasse 3'!P13)","v":""},{"$f":"IF('Liste Klasse 3'!Q13=\"\",\"\",'Liste Klasse 3'!Q13)","v":""},{"$f":"IF('Liste Klasse 3'!R13=\"\",\"\",'Liste Klasse 3'!R13)","v":0},{"$f":"'Liste Klasse 3'!S13","v":0},{"$f":"'Liste Klasse 3'!T13","v":""},{"$f":"'Liste Klasse 3'!U13","v":0}]
[{"$f":"IF('Liste Klasse 3'!A14=\"\",\"\",'Liste Klasse 3'!A14&\" / \"&'Liste Klasse 3'!B14&\" / Klasse 3\")","v":""},{"$f":"IF('Liste Klasse 3'!C14=\"\",\"\",'Liste Klasse 3'!C14)","v":""},{"$f":"IF('Liste Klasse 3'!D14=\"\",\"\",'Liste Klasse 3'!D14)","v":""},{"$f":"IF('Liste Klasse 3'!E14=\"\",\"\",'Liste Klasse 3'!E14)","v":""},{"$f":"IF('Liste Klasse 3'!F14=\"\",\"\",'Liste Klasse 3'!F14)","v":""},{"$f":"IF('Liste Klasse 3'!G14=\"\",\"\",'Liste Klasse 3'!G14)","v":""},{"$f":"IF('Liste Klasse 3'!H14=\"\",\"\",'Liste Klasse 3'!H14)","v":""},{"$f":"IF('Liste Klasse 3'!I14=\"\",\"\",'Liste Klasse 3'!I14)","v":""},{"$f":"IF('Liste Klasse 3'!J14=\"\",\"\",'Liste Klasse 3'!J14)","v":""},{"$f":"IF('Liste Klasse 3'!K14=\"\",\"\",'Liste Klasse 3'!K14)","v":""},{"$f":"IF('Liste Klasse 3'!L14=\"\",\"\",'Liste Klasse 3'!L14)","v":""},{"$f":"IF('Liste Klasse 3'!M14=\"\",\"\",'Liste Klasse 3'!M14)","v":""},{"$f":"IF('Liste Klasse 3'!N14=\"\",\"\",'Liste Klasse 3'!N14)","v":""},{"$f":"IF('Liste Klasse 3'!O14=\"\",\"\",'Liste Klasse 3'!O14)","v":""},{"$f":"IF('Liste Klasse 3'!P14=\"\",\"\",'Liste Klasse 3'!P14)","v":""},{"$f":"IF('Liste Klasse 3'!Q14=\"\",\"\",'Liste Klasse 3'!Q14)","v":""},{"$f":"IF('Liste Klasse 3'!R14=\"\",\"\",'Liste Klasse 3'!R14)","v":0},{"$f":"'Liste Klasse 3'!S14","v":0},{"$f":"'Liste Klasse 3'!T14","v":""},{"$f":"'Liste Klasse 3'!U14","v":0}]
[{"$f":"IF('Liste Klasse 3'!A15=\"\",\"\",'Liste Klasse 3'!A15&\" / \"&'Liste Klasse 3'!B15&\" / Klasse 3\")","v":""},{"$f":"IF('Liste Klasse 3'!C15=\"\",\"\",'Liste Klasse 3'!C15)","v":""},{"$f":"IF('Liste Klasse 3'!D15=\"\",\"\",'Liste Klasse 3'!D15)","v":""},{"$f":"IF('Liste Klasse 3'!E15=\"\",\"\",'Liste Klasse 3'!E15)","v":""},{"$f":"IF('Liste Klasse 3'!F15=\"\",\"\",'Liste Klasse 3'!F15)","v":""},{"$f":"IF('Liste Klasse 3'!G15=\"\",\"\",'Liste Klasse 3'!G15)","v":""},{"$f":"IF('Liste Klasse 3'!H15=\"\",\"\",'Liste Klasse 3'!H15)","v":""},{"$f":"IF('Liste Klasse 3'!I15=\"\",\"\",'Liste Klasse 3'!I15)","v":""},{"$f":"IF('Liste Klasse 3'!J15=\"\",\"\",'Liste Klasse 3'!J15)","v":""},{"$f":"IF('Liste Klasse 3'!K15=\"\",\"\",'Liste Klasse 3'!K15)","v":""},{"$f":"IF('Liste Klasse 3'!L15=\"\",\"\",'Liste Klasse 3'!L15)","v":""},{"$f":"IF('Liste Klasse 3'!M15=\"\",\"\",'Liste Klasse 3'!M15)","v":""},{"$f":"IF('Liste Klasse 3'!N15=\"\",\"\",'Liste Klasse 3'!N15)","v":""},{"$f":"IF('Liste Klasse 3'!O15=\"\",\"\",'Liste Klasse 3'!O15)","v":""},{"$f":"IF('Liste Klasse 3'!P15=\"\",\"\",'Liste Klasse 3'!P15)","v":""},{"$f":"IF('Liste Klasse 3'!Q15=\"\",\"\",'Liste Klasse 3'!Q15)","v":""},{"$f":"IF('Liste Klasse 3'!R15=\"\",\"\",'Liste Klasse 3'!R15)","v":0},{"$f":"'Liste Klasse 3'!S15","v":0},{"$f":"'Liste Klasse 3'!T15","v":""},{"$f":"'Liste Klasse 3'!U15","v":0}]
[{"$f":"IF('Liste Klasse 3'!A16=\"\",\"\",'Liste Klasse 3'!A16&\" / \"&'Liste Klasse 3'!B16&\" / Klasse 3\")","v":""},{"$f":"IF('Liste Klasse 3'!C16=\"\",\"\",'Liste Klasse 3'!C16)","v":""},{"$f":"IF('Liste Klasse 3'!D16=\"\",\"\",'Liste Klasse 3'!D16)","v":""},{"$f":"IF('Liste Klasse 3'!E16=\"\",\"\",'Liste Klasse 3'!E16)","v":""},{"$f":"IF('Liste Klasse 3'!F16=\"\",\"\",'Liste Klasse 3'!F16)","v":""},{"$f":"IF('Liste Klasse 3'!G16=\"\",\"\",'Liste Klasse 3'!G16)","v":""},{"$f":"IF('Liste Klasse 3'!H16=\"\",\"\",'Liste Klasse 3'!H16)","v":""},{"$f":"IF('Liste Klasse 3'!I16=\"\",\"\",'Liste Klasse 3'!I16)","v":""},{"$f":"IF('Liste Klasse 3'!J16=\"\",\"\",'Liste Klasse 3'!J16)","v":""},{"$f":"IF('Liste Klasse 3'!K16=\"\",\"\",'Liste Klasse 3'!K16)","v":""},{"$f":"IF('Liste Klasse 3'!L16=\"\",\"\",'Liste Klasse 3'!L16)","v":""},{"$f":"IF('Liste Klasse 3'!M16=\"\",\"\",'Liste Klasse 3'!M16)","v":""},{"$f":"IF('Liste Klasse 3'!N16=\"\",\"\",'Liste Klasse 3'!N16)","v":""},{"$f":"IF('Liste Klasse 3'!O16=\"\",\"\",'Liste Klasse 3'!O16)","v":""},{"$f":"IF('Liste Klasse 3'!P16=\"\",\"\",'Liste Klasse 3'!P16)","v":""},{"$f":"IF('Liste Klasse 3'!Q16=\"\",\"\",'Liste Klasse 3'!Q16)","v":""},{"$f":"IF('Liste Klasse 3'!R16=\"\",\"\",'Liste Klasse 3'!R16)","v":0},{"$f":"'Liste Klasse 3'!S16","v":0},{"$f":"'Liste Klasse 3'!T16","v":""},{"$f":"'Liste Klasse 3'!U16","v":0}]
[{"$f":"IF('Liste Klasse 3'!A17=\"\",\"\",'Liste Klasse 3'!A17&\" / \"&'Liste Klasse 3'!B17&\" / Klasse 3\")","v":""},{"$f":"IF('Liste Klasse 3'!C17=\"\",\"\",'Liste Klasse 3'!C17)","v":""},{"$f":"IF('Liste Klasse 3'!D17=\"\",\"\",'Liste Klasse 3'!D17)","v":""},{"$f":"IF('Liste Klasse 3'!E17=\"\",\"\",'Liste Klasse 3'!E17)","v":""},{"$f":"IF('Liste Klasse 3'!F17=\"\",\"\",'Liste Klasse 3'!F17)","v":""},{"$f":"IF('Liste Klasse 3'!G17=\"\",\"\",'Liste Klasse 3'!G17)","v":""},{"$f":"IF('Liste Klasse 3'!H17=\"\",\"\",'Liste Klasse 3'!H17)","v":""},{"$f":"IF('Liste Klasse 3'!I17=\"\",\"\",'Liste Klasse 3'!I17)","v":""},{"$f":"IF('Liste Klasse 3'!J17=\"\",\"\",'Liste Klasse 3'!J17)","v":""},{"$f":"IF('Liste Klasse 3'!K17=\"\",\"\",'Liste Klasse 3'!K17)","v":""},{"$f":"IF('Liste Klasse 3'!L17=\"\",\"\",'Liste Klasse 3'!L17)","v":""},{"$f":"IF('Liste Klasse 3'!M17=\"\",\"\",'Liste Klasse 3'!M17)","v":""},{"$f":"IF('Liste Klasse 3'!N17=\"\",\"\",'Liste Klasse 3'!N17)","v":""},{"$f":"IF('Liste Klasse 3'!O17=\"\",\"\",'Liste Klasse 3'!O17)","v":""},{"$f":"IF('Liste Klasse 3'!P17=\"\",\"\",'Liste Klasse 3'!P17)","v":""},{"$f":"IF('Liste Klasse 3'!Q17=\"\",\"\",'Liste Klasse 3'!Q17)","v":""},{"$f":"IF('Liste Klasse 3'!R17=\"\",\"\",'Liste Klasse 3'!R17)","v":0},{"$f":"'Liste Klasse 3'!S17","v":0},{"$f":"'Liste Klasse 3'!T17","v":""},{"$f":"'Liste Klasse 3'!U17","v":0}]
[{"$f":"IF('Liste Klasse 3'!A18=\"\",\"\",'Liste Klasse 3'!A18&\" / \"&'Liste Klasse 3'!B18&\" / Klasse 3\")","v":""},{"$f":"IF('Liste Klasse 3'!C18=\"\",\"\",'Liste Klasse 3'!C18)","v":""},{"$f":"IF('Liste Klasse 3'!D18=\"\",\"\",'Liste Klasse 3'!D18)","v":""},{"$f":"IF('Liste Klasse 3'!E18=\"\",\"\",'Liste Klasse 3'!E18)","v":""},{"$f":"IF('Liste Klasse 3'!F18=\"\",\"\",'Liste Klasse 3'!F18)","v":""},{"$f":"IF('Liste Klasse 3'!G18=\"\",\"\",'Liste Klasse 3'!G18)","v":""},{"$f":"IF('Liste Klasse 3'!H18=\"\",\"\",'Liste Klasse 3'!H18)","v":""},{"$f":"IF('Liste Klasse 3'!I18=\"\",\"\",'Liste Klasse 3'!I18)","v":""},{"$f":"IF('Liste Klasse 3'!J18=\"\",\"\",'Liste Klasse 3'!J18)","v":""},{"$f":"IF('Liste Klasse 3'!K18=\"\",\"\",'Liste Klasse 3'!K18)","v":""},{"$f":"IF('Liste Klasse 3'!L18=\"\",\"\",'Liste Klasse 3'!L18)","v":""},{"$f":"IF('Liste Klasse 3'!M18=\"\",\"\",'Liste Klasse 3'!M18)","v":""},{"$f":"IF('Liste Klasse 3'!N18=\"\",\"\",'Liste Klasse 3'!N18)","v":""},{"$f":"IF('Liste Klasse 3'!O18=\"\",\"\",'Liste Klasse 3'!O18)","v":""},{"$f":"IF('Liste Klasse 3'!P18=\"\",\"\",'Liste Klasse 3'!P18)","v":""},{"$f":"IF('Liste Klasse 3'!Q18=\"\",\"\",'Liste Klasse 3'!Q18)","v":""},{"$f":"IF('Liste Klasse 3'!R18=\"\",\"\",'Liste Klasse 3'!R18)","v":0},{"$f":"'Liste Klasse 3'!S18","v":0},{"$f":"'Liste Klasse 3'!T18","v":""},{"$f":"'Liste Klasse 3'!U18","v":0}]
[{"$f":"IF('Liste Klasse 3'!A19=\"\",\"\",'Liste Klasse 3'!A19&\" / \"&'Liste Klasse 3'!B19&\" / Klasse 3\")","v":""},{"$f":"IF('Liste Klasse 3'!C19=\"\",\"\",'Liste Klasse 3'!C19)","v":""},{"$f":"IF('Liste Klasse 3'!D19=\"\",\"\",'Liste Klasse 3'!D19)","v":""},{"$f":"IF('Liste Klasse 3'!E19=\"\",\"\",'Liste Klasse 3'!E19)","v":""},{"$f":"IF('Liste Klasse 3'!F19=\"\",\"\",'Liste Klasse 3'!F19)","v":""},{"$f":"IF('Liste Klasse 3'!G19=\"\",\"\",'Liste Klasse 3'!G19)","v":""},{"$f":"IF('Liste Klasse 3'!H19=\"\",\"\",'Liste Klasse 3'!H19)","v":""},{"$f":"IF('Liste Klasse 3'!I19=\"\",\"\",'Liste Klasse 3'!I19)","v":""},{"$f":"IF('Liste Klasse 3'!J19=\"\",\"\",'Liste Klasse 3'!J19)","v":""},{"$f":"IF('Liste Klasse 3'!K19=\"\",\"\",'Liste Klasse 3'!K19)","v":""},{"$f":"IF('Liste Klasse 3'!L19=\"\",\"\",'Liste Klasse 3'!L19)","v":""},{"$f":"IF('Liste Klasse 3'!M19=\"\",\"\",'Liste Klasse 3'!M19)","v":""},{"$f":"IF('Liste Klasse 3'!N19=\"\",\"\",'Liste Klasse 3'!N19)","v":""},{"$f":"IF('Liste Klasse 3'!O19=\"\",\"\",'Liste Klasse 3'!O19)","v":""},{"$f":"IF('Liste Klasse 3'!P19=\"\",\"\",'Liste Klasse 3'!P19)","v":""},{"$f":"IF('Liste Klasse 3'!Q19=\"\",\"\",'Liste Klasse 3'!Q19)","v":""},{"$f":"IF('Liste Klasse 3'!R19=\"\",\"\",'Liste Klasse 3'!R19)","v":0},{"$f":"'Liste Klasse 3'!S19","v":0},{"$f":"'Liste Klasse 3'!T19","v":""},{"$f":"'Liste Klasse 3'!U19","v":0}]
[{"$f":"IF('Liste Klasse 3'!A20=\"\",\"\",'Liste Klasse 3'!A20&\" / \"&'Liste Klasse 3'!B20&\" / Klasse 3\")","v":""},{"$f":"IF('Liste Klasse 3'!C20=\"\",\"\",'Liste Klasse 3'!C20)","v":""},{"$f":"IF('Liste Klasse 3'!D20=\"\",\"\",'Liste Klasse 3'!D20)","v":""},{"$f":"IF('Liste Klasse 3'!E20=\"\",\"\",'Liste Klasse 3'!E20)","v":""},{"$f":"IF('Liste Klasse 3'!F20=\"\",\"\",'Liste Klasse 3'!F20)","v":""},{"$f":"IF('Liste Klasse 3'!G20=\"\",\"\",'Liste Klasse 3'!G20)","v":""},{"$f":"IF('Liste Klasse 3'!H20=\"\",\"\",'Liste Klasse 3'!H20)","v":""},{"$f":"IF('Liste Klasse 3'!I20=\"\",\"\",'Liste Klasse 3'!I20)","v":""},{"$f":"IF('Liste Klasse 3'!J20=\"\",\"\",'Liste Klasse 3'!J20)","v":""},{"$f":"IF('Liste Klasse 3'!K20=\"\",\"\",'Liste Klasse 3'!K20)","v":""},{"$f":"IF('Liste Klasse 3'!L20=\"\",\"\",'Liste Klasse 3'!L20)","v":""},{"$f":"IF('Liste Klasse 3'!M20=\"\",\"\",'Liste Klasse 3'!M20)","v":""},{"$f":"IF('Liste Klasse 3'!N20=\"\",\"\",'Liste Klasse 3'!N20)","v":""},{"$f":"IF('Liste Klasse 3'!O20=\"\",\"\",'Liste Klasse 3'!O20)","v":""},{"$f":"IF('Liste Klasse 3'!P20=\"\",\"\",'Liste Klasse 3'!P20)","v":""},{"$f":"IF('Liste Klasse 3'!Q20=\"\",\"\",'Liste Klasse 3'!Q20)","v":""},{"$f":"IF('Liste Klasse 3'!R20=\"\",\"\",'Liste Klasse 3'!R20)","v":0},{"$f":"'Liste Klasse 3'!S20","v":0},{"$f":"'Liste Klasse 3'!T20","v":""},{"$f":"'Liste Klasse 3'!U20","v":0}]
[{"$f":"IF('Liste Klasse 3'!A21=\"\",\"\",'Liste Klasse 3'!A21&\" / \"&'Liste Klasse 3'!B21&\" / Klasse 3\")","v":""},{"$f":"IF('Liste Klasse 3'!C21=\"\",\"\",'Liste Klasse 3'!C21)","v":""},{"$f":"IF('Liste Klasse 3'!D21=\"\",\"\",'Liste Klasse 3'!D21)","v":""},{"$f":"IF('Liste Klasse 3'!E21=\"\",\"\",'Liste Klasse 3'!E21)","v":""},{"$f":"IF('Liste Klasse 3'!F21=\"\",\"\",'Liste Klasse 3'!F21)","v":""},{"$f":"IF('Liste Klasse 3'!G21=\"\",\"\",'Liste Klasse 3'!G21)","v":""},{"$f":"IF('Liste Klasse 3'!H21=\"\",\"\",'Liste Klasse 3'!H21)","v":""},{"$f":"IF('Liste Klasse 3'!I21=\"\",\"\",'Liste Klasse 3'!I21)","v":""},{"$f":"IF('Liste Klasse 3'!J21=\"\",\"\",'Liste Klasse 3'!J21)","v":""},{"$f":"IF('Liste Klasse 3'!K21=\"\",\"\",'Liste Klasse 3'!K21)","v":""},{"$f":"IF('Liste Klasse 3'!L21=\"\",\"\",'Liste Klasse 3'!L21)","v":""},{"$f":"IF('Liste Klasse 3'!M21=\"\",\"\",'Liste Klasse 3'!M21)","v":""},{"$f":"IF('Liste Klasse 3'!N21=\"\",\"\",'Liste Klasse 3'!N21)","v":""},{"$f":"IF('Liste Klasse 3'!O21=\"\",\"\",'Liste Klasse 3'!O21)","v":""},{"$f":"IF('Liste Klasse 3'!P21=\"\",\"\",'Liste Klasse 3'!P21)","v":""},{"$f":"IF('Liste Klasse 3'!Q21=\"\",\"\",'Liste Klasse 3'!Q21)","v":""},{"$f":"IF('Liste Klasse 3'!R21=\"\",\"\",'Liste Klasse 3'!R21)","v":0},{"$f":"'Liste Klasse 3'!S21","v":0},{"$f":"'Liste Klasse 3'!T21","v":""},{"$f":"'Liste Klasse 3'!U21","v":0}]
[{"$f":"IF('Liste Klasse 3'!A22=\"\",\"\",'Liste Klasse 3'!A22&\" / \"&'Liste Klasse 3'!B22&\" / Klasse 3\")","v":""},{"$f":"IF('Liste Klasse 3'!C22=\"\",\"\",'Liste Klasse 3'!C22)","v":""},{"$f":"IF('Liste Klasse 3'!D22=\"\",\"\",'Liste Klasse 3'!D22)","v":""},{"$f":"IF('Liste Klasse 3'!E22=\"\",\"\",'Liste Klasse 3'!E22)","v":""},{"$f":"IF('Liste Klasse 3'!F22=\"\",\"\",'Liste Klasse 3'!F22)","v":""},{"$f":"IF('Liste Klasse 3'!G22=\"\",\"\",'Liste Klasse 3'!G22)","v":""},{"$f":"IF('Liste Klasse 3'!H22=\"\",\"\",'Liste Klasse 3'!H22)","v":""},{"$f":"IF('Liste Klasse 3'!I22=\"\",\"\",'Liste Klasse 3'!I22)","v":""},{"$f":"IF('Liste Klasse 3'!J22=\"\",\"\",'Liste Klasse 3'!J22)","v":""},{"$f":"IF('Liste Klasse 3'!K22=\"\",\"\",'Liste Klasse 3'!K22)","v":""},{"$f":"IF('Liste Klasse 3'!L22=\"\",\"\",'Liste Klasse 3'!L22)","v":""},{"$f":"IF('Liste Klasse 3'!M22=\"\",\"\",'Liste Klasse 3'!M22)","v":""},{"$f":"IF('Liste Klasse 3'!N22=\"\",\"\",'Liste Klasse 3'!N22)","v":""},{"$f":"IF('Liste Klasse 3'!O22=\"\",\"\",'Liste Klasse 3'!O22)","v":""},{"$f":"IF('Liste Klasse 3'!P22=\"\",\"\",'Liste Klasse 3'!P22)","v":""},{"$f":"IF('Liste Klasse 3'!Q22=\"\",\"\",'Liste Klasse 3'!Q22)","v":""},{"$f":"IF('Liste Klasse 3'!R22=\"\",\"\",'Liste Klasse 3'!R22)","v":0},{"$f":"'Liste Klasse 3'!S22","v":0},{"$f":"'Liste Klasse 3'!T22","v":""},{"$f":"'Liste Klasse 3'!U22","v":0}]
[{"$f":"IF('Liste Klasse 3'!A23=\"\",\"\",'Liste Klasse 3'!A23&\" / \"&'Liste Klasse 3'!B23&\" / Klasse 3\")","v":""},{"$f":"IF('Liste Klasse 3'!C23=\"\",\"\",'Liste Klasse 3'!C23)","v":""},{"$f":"IF('Liste Klasse 3'!D23=\"\",\"\",'Liste Klasse 3'!D23)","v":""},{"$f":"IF('Liste Klasse 3'!E23=\"\",\"\",'Liste Klasse 3'!E23)","v":""},{"$f":"IF('Liste Klasse 3'!F23=\"\",\"\",'Liste Klasse 3'!F23)","v":""},{"$f":"IF('Liste Klasse 3'!G23=\"\",\"\",'Liste Klasse 3'!G23)","v":""},{"$f":"IF('Liste Klasse 3'!H23=\"\",\"\",'Liste Klasse 3'!H23)","v":""},{"$f":"IF('Liste Klasse 3'!I23=\"\",\"\",'Liste Klasse 3'!I23)","v":""},{"$f":"IF('Liste Klasse 3'!J23=\"\",\"\",'Liste Klasse 3'!J23)","v":""},{"$f":"IF('Liste Klasse 3'!K23=\"\",\"\",'Liste Klasse 3'!K23)","v":""},{"$f":"IF('Liste Klasse 3'!L23=\"\",\"\",'Liste Klasse 3'!L23)","v":""},{"$f":"IF('Liste Klasse 3'!M23=\"\",\"\",'Liste Klasse 3'!M23)","v":""},{"$f":"IF('Liste Klasse 3'!N23=\"\",\"\",'Liste Klasse 3'!N23)","v":""},{"$f":"IF('Liste Klasse 3'!O23=\"\",\"\",'Liste Klasse 3'!O23)","v":""},{"$f":"IF('Liste Klasse 3'!P23=\"\",\"\",'Liste Klasse 3'!P23)","v":""},{"$f":"IF('Liste Klasse 3'!Q23=\"\",\"\",'Liste Klasse 3'!Q23)","v":""},{"$f":"IF('Liste Klasse 3'!R23=\"\",\"\",'Liste Klasse 3'!R23)","v":0},{"$f":"'Liste Klasse 3'!S23","v":0},{"$f":"'Liste Klasse 3'!T23","v":""},{"$f":"'Liste Klasse 3'!U23","v":0}]
[{"$f":"IF('Liste Klasse 3'!A24=\"\",\"\",'Liste Klasse 3'!A24&\" / \"&'Liste Klasse 3'!B24&\" / Klasse 3\")","v":""},{"$f":"IF('Liste Klasse 3'!C24=\"\",\"\",'Liste Klasse 3'!C24)","v":""},{"$f":"IF('Liste Klasse 3'!D24=\"\",\"\",'Liste Klasse 3'!D24)","v":""},{"$f":"IF('Liste Klasse 3'!E24=\"\",\"\",'Liste Klasse 3'!E24)","v":""},{"$f":"IF('Liste Klasse 3'!F24=\"\",\"\",'Liste Klasse 3'!F24)","v":""},{"$f":"IF('Liste Klasse 3'!G24=\"\",\"\",'Liste Klasse 3'!G24)","v":""},{"$f":"IF('Liste Klasse 3'!H24=\"\",\"\",'Liste Klasse 3'!H24)","v":""},{"$f":"IF('Liste Klasse 3'!I24=\"\",\"\",'Liste Klasse 3'!I24)","v":""},{"$f":"IF('Liste Klasse 3'!J24=\"\",\"\",'Liste Klasse 3'!J24)","v":""},{"$f":"IF('Liste Klasse 3'!K24=\"\",\"\",'Liste Klasse 3'!K24)","v":""},{"$f":"IF('Liste Klasse 3'!L24=\"\",\"\",'Liste Klasse 3'!L24)","v":""},{"$f":"IF('Liste Klasse 3'!M24=\"\",\"\",'Liste Klasse 3'!M24)","v":""},{"$f":"IF('Liste Klasse 3'!N24=\"\",\"\",'Liste Klasse 3'!N24)","v":""},{"$f":"IF('Liste Klasse 3'!O24=\"\",\"\",'Liste Klasse 3'!O24)","v":""},{"$f":"IF('Liste Klasse 3'!P24=\"\",\"\",'Liste Klasse 3'!P24)","v":""},{"$f":"IF('Liste Klasse 3'!Q24=\"\",\"\",'Liste Klasse 3'!Q24)","v":""},{"$f":"IF('Liste Klasse 3'!R24=\"\",\"\",'Liste Klasse 3'!R24)","v":0},{"$f":"'Liste Klasse 3'!S24","v":0},{"$f":"'Liste Klasse 3'!T24","v":""},{"$f":"'Liste Klasse 3'!U24","v":0}]
[{"$f":"IF('Liste Klasse 3'!A25=\"\",\"\",'Liste Klasse 3'!A25&\" / \"&'Liste Klasse 3'!B25&\" / Klasse 3\")","v":""},{"$f":"IF('Liste Klasse 3'!C25=\"\",\"\",'Liste Klasse 3'!C25)","v":""},{"$f":"IF('Liste Klasse 3'!D25=\"\",\"\",'Liste Klasse 3'!D25)","v":""},{"$f":"IF('Liste Klasse 3'!E25=\"\",\"\",'Liste Klasse 3'!E25)","v":""},{"$f":"IF('Liste Klasse 3'!F25=\"\",\"\",'Liste Klasse 3'!F25)","v":""},{"$f":"IF('Liste Klasse 3'!G25=\"\",\"\",'Liste Klasse 3'!G25)","v":""},{"$f":"IF('Liste Klasse 3'!H25=\"\",\"\",'Liste Klasse 3'!H25)","v":""},{"$f":"IF('Liste Klasse 3'!I25=\"\",\"\",'Liste Klasse 3'!I25)","v":""},{"$f":"IF('Liste Klasse 3'!J25=\"\",\"\",'Liste Klasse 3'!J25)","v":""},{"$f":"IF('Liste Klasse 3'!K25=\"\",\"\",'Liste Klasse 3'!K25)","v":""},{"$f":"IF('Liste Klasse 3'!L25=\"\",\"\",'Liste Klasse 3'!L25)","v":""},{"$f":"IF('Liste Klasse 3'!M25=\"\",\"\",'Liste Klasse 3'!M25)","v":""},{"$f":"IF('Liste Klasse 3'!N25=\"\",\"\",'Liste Klasse 3'!N25)","v":""},{"$f":"IF('Liste Klasse 3'!O25=\"\",\"\",'Liste Klasse 3'!O25)","v":""},{"$f":"IF('Liste Klasse 3'!P25=\"\",\"\",'Liste Klasse 3'!P25)","v":""},{"$f":"IF('Liste Klasse 3'!Q25=\"\",\"\",'Liste Klasse 3'!Q25)","v":""},{"$f":"IF('Liste Klasse 3'!R25=\"\",\"\",'Liste Klasse 3'!R25)","v":0},{"$f":"'Liste Klasse 3'!S25","v":0},{"$f":"'Liste Klasse 3'!T25","v":""},{"$f":"'Liste Klasse 3'!U25","v":0}]
["Start / Los / Klasse","Hundeführer/-in","Verein","Verband","Hund","Rasse",{"$f":"IF('Liste Klasse 3'!H$4=0,\"\",'Liste Klasse 3'!H$4)","v":1},{"$f":"IF('Liste Klasse 3'!I$4=0,\"\",'Liste Klasse 3'!I$4)","v":2},{"$f":"IF('Liste Klasse 3'!J$4=0,\"\",'Liste Klasse 3'!J$4)","v":3},{"$f":"IF('Liste Klasse 3'!K$4=0,\"\",'Liste Klasse 3'!K$4)","v":4},{"$f":"IF('Liste Klasse 3'!L$4=0,\"\",'Liste Klasse 3'!L$4)","v":5},{"$f":"IF('Liste Klasse 3'!M$4=0,\"\",'Liste Klasse 3'!M$4)","v":6},{"$f":"IF('Liste Klasse 3'!N$4=0,\"\",'Liste Klasse 3'!N$4)","v":7},{"$f":"IF('Liste Klasse 3'!O$4=0,\"\",'Liste Klasse 3'!O$4)","v":8},{"$f":"IF('Liste Klasse 3'!P$4=0,\"\",'Liste Klasse 3'!P$4)","v":9},{"$f":"IF('Liste Klasse 3'!Q$4=0,\"\",'Liste Klasse 3'!Q$4)","v":10},{"$f":"IF('Liste Klasse S'!R$4=0,\"\",'Liste Klasse S'!R$4)","v":""},"Gesamt","WN","Platz"]
[{"$f":"IF('Liste Klasse S'!A8=\"\",\"\",'Liste Klasse S'!A8&\" / \"&'Liste Klasse S'!B8&\" / Klasse S\")","v":""},{"$f":"IF('Liste Klasse S'!C8=\"\",\"\",'Liste Klasse S'!C8)","v":""},{"$f":"IF('Liste Klasse S'!D8=\"\",\"\",'Liste Klasse S'!D8)","v":""},{"$f":"IF('Liste Klasse S'!E8=\"\",\"\",'Liste Klasse S'!E8)","v":""},{"$f":"IF('Liste Klasse S'!F8=\"\",\"\",'Liste Klasse S'!F8)","v":""},{"$f":"IF('Liste Klasse S'!G8=\"\",\"\",'Liste Klasse S'!G8)","v":""},{"$f":"IF('Liste Klasse S'!H8=\"\",\"\",'Liste Klasse S'!H8)","v":""},{"$f":"IF('Liste Klasse S'!I8=\"\",\"\",'Liste Klasse S'!I8)","v":""},{"$f":"IF('Liste Klasse S'!J8=\"\",\"\",'Liste Klasse S'!J8)","v":""},{"$f":"IF('Liste Klasse S'!K8=\"\",\"\",'Liste Klasse S'!K8)","v":""},{"$f":"IF('Liste Klasse S'!L8=\"\",\"\",'Liste Klasse S'!L8)","v":""},{"$f":"IF('Liste Klasse S'!M8=\"\",\"\",'Liste Klasse S'!M8)","v":""},{"$f":"IF('Liste Klasse S'!N8=\"\",\"\",'Liste Klasse S'!N8)","v":""},{"$f":"IF('Liste Klasse S'!O8=\"\",\"\",'Liste Klasse S'!O8)","v":""},{"$f":"IF('Liste Klasse S'!P8=\"\",\"\",'Liste Klasse S'!P8)","v":""},{"$f":"IF('Liste Klasse S'!Q8=\"\",\"\",'Liste Klasse S'!Q8)","v":""},{"$f":"IF('Liste Klasse S'!R8=\"\",\"\",'Liste Klasse S'!R8)","v":""},{"$f":"'Liste Klasse S'!S8","v":0},{"$f":"'Liste Klasse S'!T8","v":""},{"$f":"'Liste Klasse S'!U8","v":0}]
[{"$f":"IF('Liste Klasse S'!A9=\"\",\"\",'Liste Klasse S'!A9&\" / \"&'Liste Klasse S'!B9&\" / Klasse S\")","v":""},{"$f":"IF('Liste Klasse S'!C9=\"\",\"\",'Liste Klasse S'!C9)","v":""},{"$f":"IF('Liste Klasse S'!D9=\"\",\"\",'Liste Klasse S'!D9)","v":""},{"$f":"IF('Liste Klasse S'!E9=\"\",\"\",'Liste Klasse S'!E9)","v":""},{"$f":"IF('Liste Klasse S'!F9=\"\",\"\",'Liste Klasse S'!F9)","v":""},{"$f":"IF('Liste Klasse S'!G9=\"\",\"\",'Liste Klasse S'!G9)","v":""},{"$f":"IF('Liste Klasse S'!H9=\"\",\"\",'Liste Klasse S'!H9)","v":""},{"$f":"IF('Liste Klasse S'!I9=\"\",\"\",'Liste Klasse S'!I9)","v":""},{"$f":"IF('Liste Klasse S'!J9=\"\",\"\",'Liste Klasse S'!J9)","v":""},{"$f":"IF('Liste Klasse S'!K9=\"\",\"\",'Liste Klasse S'!K9)","v":""},{"$f":"IF('Liste Klasse S'!L9=\"\",\"\",'Liste Klasse S'!L9)","v":""},{"$f":"IF('Liste Klasse S'!M9=\"\",\"\",'Liste Klasse S'!M9)","v":""},{"$f":"IF('Liste Klasse S'!N9=\"\",\"\",'Liste Klasse S'!N9)","v":""},{"$f":"IF('Liste Klasse S'!O9=\"\",\"\",'Liste Klasse S'!O9)","v":""},{"$f":"IF('Liste Klasse S'!P9=\"\",\"\",'Liste Klasse S'!P9)","v":""},{"$f":"IF('Liste Klasse S'!Q9=\"\",\"\",'Liste Klasse S'!Q9)","v":""},{"$f":"IF('Liste Klasse S'!R9=\"\",\"\",'Liste Klasse S'!R9)","v":""},{"$f":"'Liste Klasse S'!S9","v":0},{"$f":"'Liste Klasse S'!T9","v":""},{"$f":"'Liste Klasse S'!U9","v":0}]
[{"$f":"IF('Liste Klasse S'!A10=\"\",\"\",'Liste Klasse S'!A10&\" / \"&'Liste Klasse S'!B10&\" / Klasse S\")","v":""},{"$f":"IF('Liste Klasse S'!C10=\"\",\"\",'Liste Klasse S'!C10)","v":""},{"$f":"IF('Liste Klasse S'!D10=\"\",\"\",'Liste Klasse S'!D10)","v":""},{"$f":"IF('Liste Klasse S'!E10=\"\",\"\",'Liste Klasse S'!E10)","v":""},{"$f":"IF('Liste Klasse S'!F10=\"\",\"\",'Liste Klasse S'!F10)","v":""},{"$f":"IF('Liste Klasse S'!G10=\"\",\"\",'Liste Klasse S'!G10)","v":""},{"$f":"IF('Liste Klasse S'!H10=\"\",\"\",'Liste Klasse S'!H10)","v":""},{"$f":"IF('Liste Klasse S'!I10=\"\",\"\",'Liste Klasse S'!I10)","v":""},{"$f":"IF('Liste Klasse S'!J10=\"\",\"\",'Liste Klasse S'!J10)","v":""},{"$f":"IF('Liste Klasse S'!K10=\"\",\"\",'Liste Klasse S'!K10)","v":""},{"$f":"IF('Liste Klasse S'!L10=\"\",\"\",'Liste Klasse S'!L10)","v":""},{"$f":"IF('Liste Klasse S'!M10=\"\",\"\",'Liste Klasse S'!M10)","v":""},{"$f":"IF('Liste Klasse S'!N10=\"\",\"\",'Liste Klasse S'!N10)","v":""},{"$f":"IF('Liste Klasse S'!O10=\"\",\"\",'Liste Klasse S'!O10)","v":""},{"$f":"IF('Liste Klasse S'!P10=\"\",\"\",'Liste Klasse S'!P10)","v":""},{"$f":"IF('Liste Klasse S'!Q10=\"\",\"\",'Liste Klasse S'!Q10)","v":""},{"$f":"IF('Liste Klasse S'!R10=\"\",\"\",'Liste Klasse S'!R10)","v":""},{"$f":"'Liste Klasse S'!S10","v":0},{"$f":"'Liste Klasse S'!T10","v":""},{"$f":"'Liste Klasse S'!U10","v":0}]
[{"$f":"IF('Liste Klasse S'!A11=\"\",\"\",'Liste Klasse S'!A11&\" / \"&'Liste Klasse S'!B11&\" / Klasse S\")","v":""},{"$f":"IF('Liste Klasse S'!C11=\"\",\"\",'Liste Klasse S'!C11)","v":""},{"$f":"IF('Liste Klasse S'!D11=\"\",\"\",'Liste Klasse S'!D11)","v":""},{"$f":"IF('Liste Klasse S'!E11=\"\",\"\",'Liste Klasse S'!E11)","v":""},{"$f":"IF('Liste Klasse S'!F11=\"\",\"\",'Liste Klasse S'!F11)","v":""},{"$f":"IF('Liste Klasse S'!G11=\"\",\"\",'Liste Klasse S'!G11)","v":""},{"$f":"IF('Liste Klasse S'!H11=\"\",\"\",'Liste Klasse S'!H11)","v":""},{"$f":"IF('Liste Klasse S'!I11=\"\",\"\",'Liste Klasse S'!I11)","v":""},{"$f":"IF('Liste Klasse S'!J11=\"\",\"\",'Liste Klasse S'!J11)","v":""},{"$f":"IF('Liste Klasse S'!K11=\"\",\"\",'Liste Klasse S'!K11)","v":""},{"$f":"IF('Liste Klasse S'!L11=\"\",\"\",'Liste Klasse S'!L11)","v":""},{"$f":"IF('Liste Klasse S'!M11=\"\",\"\",'Liste Klasse S'!M11)","v":""},{"$f":"IF('Liste Klasse S'!N11=\"\",\"\",'Liste Klasse S'!N11)","v":""},{"$f":"IF('Liste Klasse S'!O11=\"\",\"\",'Liste Klasse S'!O11)","v":""},{"$f":"IF('Liste Klasse S'!P11=\"\",\"\",'Liste Klasse S'!P11)","v":""},{"$f":"IF('Liste Klasse S'!Q11=\"\",\"\",'Liste Klasse S'!Q11)","v":""},{"$f":"IF('Liste Klasse S'!R11=\"\",\"\",'Liste Klasse S'!R11)","v":""},{"$f":"'Liste Klasse S'!S11","v":0},{"$f":"'Liste Klasse S'!T11","v":""},{"$f":"'Liste Klasse S'!U11","v":0}]
[{"$f":"IF('Liste Klasse S'!A12=\"\",\"\",'Liste Klasse S'!A12&\" / \"&'Liste Klasse S'!B12&\" / Klasse S\")","v":""},{"$f":"IF('Liste Klasse S'!C12=\"\",\"\",'Liste Klasse S'!C12)","v":""},{"$f":"IF('Liste Klasse S'!D12=\"\",\"\",'Liste Klasse S'!D12)","v":""},{"$f":"IF('Liste Klasse S'!E12=\"\",\"\",'Liste Klasse S'!E12)","v":""},{"$f":"IF('Liste Klasse S'!F12=\"\",\"\",'Liste Klasse S'!F12)","v":""},{"$f":"IF('Liste Klasse S'!G12=\"\",\"\",'Liste Klasse S'!G12)","v":""},{"$f":"IF('Liste Klasse S'!H12=\"\",\"\",'Liste Klasse S'!H12)","v":""},{"$f":"IF('Liste Klasse S'!I12=\"\",\"\",'Liste Klasse S'!I12)","v":""},{"$f":"IF('Liste Klasse S'!J12=\"\",\"\",'Liste Klasse S'!J12)","v":""},{"$f":"IF('Liste Klasse S'!K12=\"\",\"\",'Liste Klasse S'!K12)","v":""},{"$f":"IF('Liste Klasse S'!L12=\"\",\"\",'Liste Klasse S'!L12)","v":""},{"$f":"IF('Liste Klasse S'!M12=\"\",\"\",'Liste Klasse S'!M12)","v":""},{"$f":"IF('Liste Klasse S'!N12=\"\",\"\",'Liste Klasse S'!N12)","v":""},{"$f":"IF('Liste Klasse S'!O12=\"\",\"\",'Liste Klasse S'!O12)","v":""},{"$f":"IF('Liste Klasse S'!P12=\"\",\"\",'Liste Klasse S'!P12)","v":""},{"$f":"IF('Liste Klasse S'!Q12=\"\",\"\",'Liste Klasse S'!Q12)","v":""},{"$f":"IF('Liste Klasse S'!R12=\"\",\"\",'Liste Klasse S'!R12)","v":""},{"$f":"'Liste Klasse S'!S12","v":0},{"$f":"'Liste Klasse S'!T12","v":""},{"$f":"'Liste Klasse S'!U12","v":0}]
[{"$f":"IF('Liste Klasse S'!A13=\"\",\"\",'Liste Klasse S'!A13&\" / \"&'Liste Klasse S'!B13&\" / Klasse S\")","v":""},{"$f":"IF('Liste Klasse S'!C13=\"\",\"\",'Liste Klasse S'!C13)","v":""},{"$f":"IF('Liste Klasse S'!D13=\"\",\"\",'Liste Klasse S'!D13)","v":""},{"$f":"IF('Liste Klasse S'!E13=\"\",\"\",'Liste Klasse S'!E13)","v":""},{"$f":"IF('Liste Klasse S'!F13=\"\",\"\",'Liste Klasse S'!F13)","v":""},{"$f":"IF('Liste Klasse S'!G13=\"\",\"\",'Liste Klasse S'!G13)","v":""},{"$f":"IF('Liste Klasse S'!H13=\"\",\"\",'Liste Klasse S'!H13)","v":""},{"$f":"IF('Liste Klasse S'!I13=\"\",\"\",'Liste Klasse S'!I13)","v":""},{"$f":"IF('Liste Klasse S'!J13=\"\",\"\",'Liste Klasse S'!J13)","v":""},{"$f":"IF('Liste Klasse S'!K13=\"\",\"\",'Liste Klasse S'!K13)","v":""},{"$f":"IF('Liste Klasse S'!L13=\"\",\"\",'Liste Klasse S'!L13)","v":""},{"$f":"IF('Liste Klasse S'!M13=\"\",\"\",'Liste Klasse S'!M13)","v":""},{"$f":"IF('Liste Klasse S'!N13=\"\",\"\",'Liste Klasse S'!N13)","v":""},{"$f":"IF('Liste Klasse S'!O13=\"\",\"\",'Liste Klasse S'!O13)","v":""},{"$f":"IF('Liste Klasse S'!P13=\"\",\"\",'Liste Klasse S'!P13)","v":""},{"$f":"IF('Liste Klasse S'!Q13=\"\",\"\",'Liste Klasse S'!Q13)","v":""},{"$f":"IF('Liste Klasse S'!R13=\"\",\"\",'Liste Klasse S'!R13)","v":""},{"$f":"'Liste Klasse S'!S13","v":0},{"$f":"'Liste Klasse S'!T13","v":""},{"$f":"'Liste Klasse S'!U13","v":0}]
[{"$f":"IF('Liste Klasse S'!A14=\"\",\"\",'Liste Klasse S'!A14&\" / \"&'Liste Klasse S'!B14&\" / Klasse S\")","v":""},{"$f":"IF('Liste Klasse S'!C14=\"\",\"\",'Liste Klasse S'!C14)","v":""},{"$f":"IF('Liste Klasse S'!D14=\"\",\"\",'Liste Klasse S'!D14)","v":""},{"$f":"IF('Liste Klasse S'!E14=\"\",\"\",'Liste Klasse S'!E14)","v":""},{"$f":"IF('Liste Klasse S'!F14=\"\",\"\",'Liste Klasse S'!F14)","v":""},{"$f":"IF('Liste Klasse S'!G14=\"\",\"\",'Liste Klasse S'!G14)","v":""},{"$f":"IF('Liste Klasse S'!H14=\"\",\"\",'Liste Klasse S'!H14)","v":""},{"$f":"IF('Liste Klasse S'!I14=\"\",\"\",'Liste Klasse S'!I14)","v":""},{"$f":"IF('Liste Klasse S'!J14=\"\",\"\",'Liste Klasse S'!J14)","v":""},{"$f":"IF('Liste Klasse S'!K14=\"\",\"\",'Liste Klasse S'!K14)","v":""},{"$f":"IF('Liste Klasse S'!L14=\"\",\"\",'Liste Klasse S'!L14)","v":""},{"$f":"IF('Liste Klasse S'!M14=\"\",\"\",'Liste Klasse S'!M14)","v":""},{"$f":"IF('Liste Klasse S'!N14=\"\",\"\",'Liste Klasse S'!N14)","v":""},{"$f":"IF('Liste Klasse S'!O14=\"\",\"\",'Liste Klasse S'!O14)","v":""},{"$f":"IF('Liste Klasse S'!P14=\"\",\"\",'Liste Klasse S'!P14)","v":""},{"$f":"IF('Liste Klasse S'!Q14=\"\",\"\",'Liste Klasse S'!Q14)","v":""},{"$f":"IF('Liste Klasse S'!R14=\"\",\"\",'Liste Klasse S'!R14)","v":""},{"$f":"'Liste Klasse S'!S14","v":0},{"$f":"'Liste Klasse S'!T14","v":""},{"$f":"'Liste Klasse S'!U14","v":0}]
[{"$f":"IF('Liste Klasse S'!A15=\"\",\"\",'Liste Klasse S'!A15&\" / \"&'Liste Klasse S'!B15&\" / Klasse S\")","v":""},{"$f":"IF('Liste Klasse S'!C15=\"\",\"\",'Liste Klasse S'!C15)","v":""},{"$f":"IF('Liste Klasse S'!D15=\"\",\"\",'Liste Klasse S'!D15)","v":""},{"$f":"IF('Liste Klasse S'!E15=\"\",\"\",'Liste Klasse S'!E15)","v":""},{"$f":"IF('Liste Klasse S'!F15=\"\",\"\",'Liste Klasse S'!F15)","v":""},{"$f":"IF('Liste Klasse S'!G15=\"\",\"\",'Liste Klasse S'!G15)","v":""},{"$f":"IF('Liste Klasse S'!H15=\"\",\"\",'Liste Klasse S'!H15)","v":""},{"$f":"IF('Liste Klasse S'!I15=\"\",\"\",'Liste Klasse S'!I15)","v":""},{"$f":"IF('Liste Klasse S'!J15=\"\",\"\",'Liste Klasse S'!J15)","v":""},{"$f":"IF('Liste Klasse S'!K15=\"\",\"\",'Liste Klasse S'!K15)","v":""},{"$f":"IF('Liste Klasse S'!L15=\"\",\"\",'Liste Klasse S'!L15)","v":""},{"$f":"IF('Liste Klasse S'!M15=\"\",\"\",'Liste Klasse S'!M15)","v":""},{"$f":"IF('Liste Klasse S'!N15=\"\",\"\",'Liste Klasse S'!N15)","v":""},{"$f":"IF('Liste Klasse S'!O15=\"\",\"\",'Liste Klasse S'!O15)","v":""},{"$f":"IF('Liste Klasse S'!P15=\"\",\"\",'Liste Klasse S'!P15)","v":""},{"$f":"IF('Liste Klasse S'!Q15=\"\",\"\",'Liste Klasse S'!Q15)","v":""},{"$f":"IF('Liste Klasse S'!R15=\"\",\"\",'Liste Klasse S'!R15)","v":""},{"$f":"'Liste Klasse S'!S15","v":0},{"$f":"'Liste Klasse S'!T15","v":""},{"$f":"'Liste Klasse S'!U15","v":0}]
[{"$f":"IF('Liste Klasse S'!A16=\"\",\"\",'Liste Klasse S'!A16&\" / \"&'Liste Klasse S'!B16&\" / Klasse S\")","v":""},{"$f":"IF('Liste Klasse S'!C16=\"\",\"\",'Liste Klasse S'!C16)","v":""},{"$f":"IF('Liste Klasse S'!D16=\"\",\"\",'Liste Klasse S'!D16)","v":""},{"$f":"IF('Liste Klasse S'!E16=\"\",\"\",'Liste Klasse S'!E16)","v":""},{"$f":"IF('Liste Klasse S'!F16=\"\",\"\",'Liste Klasse S'!F16)","v":""},{"$f":"IF('Liste Klasse S'!G16=\"\",\"\",'Liste Klasse S'!G16)","v":""},{"$f":"IF('Liste Klasse S'!H16=\"\",\"\",'Liste Klasse S'!H16)","v":""},{"$f":"IF('Liste Klasse S'!I16=\"\",\"\",'Liste Klasse S'!I16)","v":""},{"$f":"IF('Liste Klasse S'!J16=\"\",\"\",'Liste Klasse S'!J16)","v":""},{"$f":"IF('Liste Klasse S'!K16=\"\",\"\",'Liste Klasse S'!K16)","v":""},{"$f":"IF('Liste Klasse S'!L16=\"\",\"\",'Liste Klasse S'!L16)","v":""},{"$f":"IF('Liste Klasse S'!M16=\"\",\"\",'Liste Klasse S'!M16)","v":""},{"$f":"IF('Liste Klasse S'!N16=\"\",\"\",'Liste Klasse S'!N16)","v":""},{"$f":"IF('Liste Klasse S'!O16=\"\",\"\",'Liste Klasse S'!O16)","v":""},{"$f":"IF('Liste Klasse S'!P16=\"\",\"\",'Liste Klasse S'!P16)","v":""},{"$f":"IF('Liste Klasse S'!Q16=\"\",\"\",'Liste Klasse S'!Q16)","v":""},{"$f":"IF('Liste Klasse S'!R16=\"\",\"\",'Liste Klasse S'!R16)","v":""},{"$f":"'Liste Klasse S'!S16","v":0},{"$f":"'Liste Klasse S'!T16","v":""},{"$f":"'Liste Klasse S'!U16","v":0}]
[{"$f":"IF('Liste Klasse S'!A17=\"\",\"\",'Liste Klasse S'!A17&\" / \"&'Liste Klasse S'!B17&\" / Klasse S\")","v":""},{"$f":"IF('Liste Klasse S'!C17=\"\",\"\",'Liste Klasse S'!C17)","v":""},{"$f":"IF('Liste Klasse S'!D17=\"\",\"\",'Liste Klasse S'!D17)","v":""},{"$f":"IF('Liste Klasse S'!E17=\"\",\"\",'Liste Klasse S'!E17)","v":""},{"$f":"IF('Liste Klasse S'!F17=\"\",\"\",'Liste Klasse S'!F17)","v":""},{"$f":"IF('Liste Klasse S'!G17=\"\",\"\",'Liste Klasse S'!G17)","v":""},{"$f":"IF('Liste Klasse S'!H17=\"\",\"\",'Liste Klasse S'!H17)","v":""},{"$f":"IF('Liste Klasse S'!I17=\"\",\"\",'Liste Klasse S'!I17)","v":""},{"$f":"IF('Liste Klasse S'!J17=\"\",\"\",'Liste Klasse S'!J17)","v":""},{"$f":"IF('Liste Klasse S'!K17=\"\",\"\",'Liste Klasse S'!K17)","v":""},{"$f":"IF('Liste Klasse S'!L17=\"\",\"\",'Liste Klasse S'!L17)","v":""},{"$f":"IF('Liste Klasse S'!M17=\"\",\"\",'Liste Klasse S'!M17)","v":""},{"$f":"IF('Liste Klasse S'!N17=\"\",\"\",'Liste Klasse S'!N17)","v":""},{"$f":"IF('Liste Klasse S'!O17=\"\",\"\",'Liste Klasse S'!O17)","v":""},{"$f":"IF('Liste Klasse S'!P17=\"\",\"\",'Liste Klasse S'!P17)","v":""},{"$f":"IF('Liste Klasse S'!Q17=\"\",\"\",'Liste Klasse S'!Q17)","v":""},{"$f":"IF('Liste Klasse S'!R17=\"\",\"\",'Liste Klasse S'!R17)","v":""},{"$f":"'Liste Klasse S'!S17","v":0},{"$f":"'Liste Klasse S'!T17","v":""},{"$f":"'Liste Klasse S'!U17","v":0}]
[{"$f":"IF('Liste Klasse S'!A18=\"\",\"\",'Liste Klasse S'!A18&\" / \"&'Liste Klasse S'!B18&\" / Klasse S\")","v":""},{"$f":"IF('Liste Klasse S'!C18=\"\",\"\",'Liste Klasse S'!C18)","v":""},{"$f":"IF('Liste Klasse S'!D18=\"\",\"\",'Liste Klasse S'!D18)","v":""},{"$f":"IF('Liste Klasse S'!E18=\"\",\"\",'Liste Klasse S'!E18)","v":""},{"$f":"IF('Liste Klasse S'!F18=\"\",\"\",'Liste Klasse S'!F18)","v":""},{"$f":"IF('Liste Klasse S'!G18=\"\",\"\",'Liste Klasse S'!G18)","v":""},{"$f":"IF('Liste Klasse S'!H18=\"\",\"\",'Liste Klasse S'!H18)","v":""},{"$f":"IF('Liste Klasse S'!I18=\"\",\"\",'Liste Klasse S'!I18)","v":""},{"$f":"IF('Liste Klasse S'!J18=\"\",\"\",'Liste Klasse S'!J18)","v":""},{"$f":"IF('Liste Klasse S'!K18=\"\",\"\",'Liste Klasse S'!K18)","v":""},{"$f":"IF('Liste Klasse S'!L18=\"\",\"\",'Liste Klasse S'!L18)","v":""},{"$f":"IF('Liste Klasse S'!M18=\"\",\"\",'Liste Klasse S'!M18)","v":""},{"$f":"IF('Liste Klasse S'!N18=\"\",\"\",'Liste Klasse S'!N18)","v":""},{"$f":"IF('Liste Klasse S'!O18=\"\",\"\",'Liste Klasse S'!O18)","v":""},{"$f":"IF('Liste Klasse S'!P18=\"\",\"\",'Liste Klasse S'!P18)","v":""},{"$f":"IF('Liste Klasse S'!Q18=\"\",\"\",'Liste Klasse S'!Q18)","v":""},{"$f":"IF('Liste Klasse S'!R18=\"\",\"\",'Liste Klasse S'!R18)","v":""},{"$f":"'Liste Klasse S'!S18","v":0},{"$f":"'Liste Klasse S'!T18","v":""},{"$f":"'Liste Klasse S'!U18","v":0}]
[{"$f":"IF('Liste Klasse S'!A19=\"\",\"\",'Liste Klasse S'!A19&\" / \"&'Liste Klasse S'!B19&\" / Klasse S\")","v":""},{"$f":"IF('Liste Klasse S'!C19=\"\",\"\",'Liste Klasse S'!C19)","v":""},{"$f":"IF('Liste Klasse S'!D19=\"\",\"\",'Liste Klasse S'!D19)","v":""},{"$f":"IF('Liste Klasse S'!E19=\"\",\"\",'Liste Klasse S'!E19)","v":""},{"$f":"IF('Liste Klasse S'!F19=\"\",\"\",'Liste Klasse S'!F19)","v":""},{"$f":"IF('Liste Klasse S'!G19=\"\",\"\",'Liste Klasse S'!G19)","v":""},{"$f":"IF('Liste Klasse S'!H19=\"\",\"\",'Liste Klasse S'!H19)","v":""},{"$f":"IF('Liste Klasse S'!I19=\"\",\"\",'Liste Klasse S'!I19)","v":""},{"$f":"IF('Liste Klasse S'!J19=\"\",\"\",'Liste Klasse S'!J19)","v":""},{"$f":"IF('Liste Klasse S'!K19=\"\",\"\",'Liste Klasse S'!K19)","v":""},{"$f":"IF('Liste Klasse S'!L19=\"\",\"\",'Liste Klasse S'!L19)","v":""},{"$f":"IF('Liste Klasse S'!M19=\"\",\"\",'Liste Klasse S'!M19)","v":""},{"$f":"IF('Liste Klasse S'!N19=\"\",\"\",'Liste Klasse S'!N19)","v":""},{"$f":"IF('Liste Klasse S'!O19=\"\",\"\",'Liste Klasse S'!O19)","v":""},{"$f":"IF('Liste Klasse S'!P19=\"\",\"\",'Liste Klasse S'!P19)","v":""},{"$f":"IF('Liste Klasse S'!Q19=\"\",\"\",'Liste Klasse S'!Q19)","v":""},{"$f":"IF('Liste Klasse S'!R19=\"\",\"\",'Liste Klasse S'!R19)","v":""},{"$f":"'Liste Klasse S'!S19","v":0},{"$f":"'Liste Klasse S'!T19","v":""},{"$f":"'Liste Klasse S'!U19","v":0}]
[{"$f":"IF('Liste Klasse S'!A20=\"\",\"\",'Liste Klasse S'!A20&\" / \"&'Liste Klasse S'!B20&\" / Klasse S\")","v":""},{"$f":"IF('Liste Klasse S'!C20=\"\",\"\",'Liste Klasse S'!C20)","v":""},{"$f":"IF('Liste Klasse S'!D20=\"\",\"\",'Liste Klasse S'!D20)","v":""},{"$f":"IF('Liste Klasse S'!E20=\"\",\"\",'Liste Klasse S'!E20)","v":""},{"$f":"IF('Liste Klasse S'!F20=\"\",\"\",'Liste Klasse S'!F20)","v":""},{"$f":"IF('Liste Klasse S'!G20=\"\",\"\",'Liste Klasse S'!G20)","v":""},{"$f":"IF('Liste Klasse S'!H20=\"\",\"\",'Liste Klasse S'!H20)","v":""},{"$f":"IF('Liste Klasse S'!I20=\"\",\"\",'Liste Klasse S'!I20)","v":""},{"$f":"IF('Liste Klasse S'!J20=\"\",\"\",'Liste Klasse S'!J20)","v":""},{"$f":"IF('Liste Klasse S'!K20=\"\",\"\",'Liste Klasse S'!K20)","v":""},{"$f":"IF('Liste Klasse S'!L20=\"\",\"\",'Liste Klasse S'!L20)","v":""},{"$f":"IF('Liste Klasse S'!M20=\"\",\"\",'Liste Klasse S'!M20)","v":""},{"$f":"IF('Liste Klasse S'!N20=\"\",\"\",'Liste Klasse S'!N20)","v":""},{"$f":"IF('Liste Klasse S'!O20=\"\",\"\",'Liste Klasse S'!O20)","v":""},{"$f":"IF('Liste Klasse S'!P20=\"\",\"\",'Liste Klasse S'!P20)","v":""},{"$f":"IF('Liste Klasse S'!Q20=\"\",\"\",'Liste Klasse S'!Q20)","v":""},{"$f":"IF('Liste Klasse S'!R20=\"\",\"\",'Liste Klasse S'!R20)","v":""},{"$f":"'Liste Klasse S'!S20","v":0},{"$f":"'Liste Klasse S'!T20","v":""},{"$f":"'Liste Klasse S'!U20","v":0}]
[{"$f":"IF('Liste Klasse S'!A21=\"\",\"\",'Liste Klasse S'!A21&\" / \"&'Liste Klasse S'!B21&\" / Klasse S\")","v":""},{"$f":"IF('Liste Klasse S'!C21=\"\",\"\",'Liste Klasse S'!C21)","v":""},{"$f":"IF('Liste Klasse S'!D21=\"\",\"\",'Liste Klasse S'!D21)","v":""},{"$f":"IF('Liste Klasse S'!E21=\"\",\"\",'Liste Klasse S'!E21)","v":""},{"$f":"IF('Liste Klasse S'!F21=\"\",\"\",'Liste Klasse S'!F21)","v":""},{"$f":"IF('Liste Klasse S'!G21=\"\",\"\",'Liste Klasse S'!G21)","v":""},{"$f":"IF('Liste Klasse S'!H21=\"\",\"\",'Liste Klasse S'!H21)","v":""},{"$f":"IF('Liste Klasse S'!I21=\"\",\"\",'Liste Klasse S'!I21)","v":""},{"$f":"IF('Liste Klasse S'!J21=\"\",\"\",'Liste Klasse S'!J21)","v":""},{"$f":"IF('Liste Klasse S'!K21=\"\",\"\",'Liste Klasse S'!K21)","v":""},{"$f":"IF('Liste Klasse S'!L21=\"\",\"\",'Liste Klasse S'!L21)","v":""},{"$f":"IF('Liste Klasse S'!M21=\"\",\"\",'Liste Klasse S'!M21)","v":""},{"$f":"IF('Liste Klasse S'!N21=\"\",\"\",'Liste Klasse S'!N21)","v":""},{"$f":"IF('Liste Klasse S'!O21=\"\",\"\",'Liste Klasse S'!O21)","v":""},{"$f":"IF('Liste Klasse S'!P21=\"\",\"\",'Liste Klasse S'!P21)","v":""},{"$f":"IF('Liste Klasse S'!Q21=\"\",\"\",'Liste Klasse S'!Q21)","v":""},{"$f":"IF('Liste Klasse S'!R21=\"\",\"\",'Liste Klasse S'!R21)","v":""},{"$f":"'Liste Klasse S'!S21","v":0},{"$f":"'Liste Klasse S'!T21","v":""},{"$f":"'Liste Klasse S'!U21","v":0}]
[{"$f":"IF('Liste Klasse S'!A22=\"\",\"\",'Liste Klasse S'!A22&\" / \"&'Liste Klasse S'!B22&\" / Klasse S\")","v":""},{"$f":"IF('Liste Klasse S'!C22=\"\",\"\",'Liste Klasse S'!C22)","v":""},{"$f":"IF('Liste Klasse S'!D22=\"\",\"\",'Liste Klasse S'!D22)","v":""},{"$f":"IF('Liste Klasse S'!E22=\"\",\"\",'Liste Klasse S'!E22)","v":""},{"$f":"IF('Liste Klasse S'!F22=\"\",\"\",'Liste Klasse S'!F22)","v":""},{"$f":"IF('Liste Klasse S'!G22=\"\",\"\",'Liste Klasse S'!G22)","v":""},{"$f":"IF('Liste Klasse S'!H22=\"\",\"\",'Liste Klasse S'!H22)","v":""},{"$f":"IF('Liste Klasse S'!I22=\"\",\"\",'Liste Klasse S'!I22)","v":""},{"$f":"IF('Liste Klasse S'!J22=\"\",\"\",'Liste Klasse S'!J22)","v":""},{"$f":"IF('Liste Klasse S'!K22=\"\",\"\",'Liste Klasse S'!K22)","v":""},{"$f":"IF('Liste Klasse S'!L22=\"\",\"\",'Liste Klasse S'!L22)","v":""},{"$f":"IF('Liste Klasse S'!M22=\"\",\"\",'Liste Klasse S'!M22)","v":""},{"$f":"IF('Liste Klasse S'!N22=\"\",\"\",'Liste Klasse S'!N22)","v":""},{"$f":"IF('Liste Klasse S'!O22=\"\",\"\",'Liste Klasse S'!O22)","v":""},{"$f":"IF('Liste Klasse S'!P22=\"\",\"\",'Liste Klasse S'!P22)","v":""},{"$f":"IF('Liste Klasse S'!Q22=\"\",\"\",'Liste Klasse S'!Q22)","v":""},{"$f":"IF('Liste Klasse S'!R22=\"\",\"\",'Liste Klasse S'!R22)","v":""},{"$f":"'Liste Klasse S'!S22","v":0},{"$f":"'Liste Klasse S'!T22","v":""},{"$f":"'Liste Klasse S'!U22","v":0}]
[{"$f":"IF('Liste Klasse S'!A23=\"\",\"\",'Liste Klasse S'!A23&\" / \"&'Liste Klasse S'!B23&\" / Klasse S\")","v":""},{"$f":"IF('Liste Klasse S'!C23=\"\",\"\",'Liste Klasse S'!C23)","v":""},{"$f":"IF('Liste Klasse S'!D23=\"\",\"\",'Liste Klasse S'!D23)","v":""},{"$f":"IF('Liste Klasse S'!E23=\"\",\"\",'Liste Klasse S'!E23)","v":""},{"$f":"IF('Liste Klasse S'!F23=\"\",\"\",'Liste Klasse S'!F23)","v":""},{"$f":"IF('Liste Klasse S'!G23=\"\",\"\",'Liste Klasse S'!G23)","v":""},{"$f":"IF('Liste Klasse S'!H23=\"\",\"\",'Liste Klasse S'!H23)","v":""},{"$f":"IF('Liste Klasse S'!I23=\"\",\"\",'Liste Klasse S'!I23)","v":""},{"$f":"IF('Liste Klasse S'!J23=\"\",\"\",'Liste Klasse S'!J23)","v":""},{"$f":"IF('Liste Klasse S'!K23=\"\",\"\",'Liste Klasse S'!K23)","v":""},{"$f":"IF('Liste Klasse S'!L23=\"\",\"\",'Liste Klasse S'!L23)","v":""},{"$f":"IF('Liste Klasse S'!M23=\"\",\"\",'Liste Klasse S'!M23)","v":""},{"$f":"IF('Liste Klasse S'!N23=\"\",\"\",'Liste Klasse S'!N23)","v":""},{"$f":"IF('Liste Klasse S'!O23=\"\",\"\",'Liste Klasse S'!O23)","v":""},{"$f":"IF('Liste Klasse S'!P23=\"\",\"\",'Liste Klasse S'!P23)","v":""},{"$f":"IF('Liste Klasse S'!Q23=\"\",\"\",'Liste Klasse S'!Q23)","v":""},{"$f":"IF('Liste Klasse S'!R23=\"\",\"\",'Liste Klasse S'!R23)","v":""},{"$f":"'Liste Klasse S'!S23","v":0},{"$f":"'Liste Klasse S'!T23","v":""},{"$f":"'Liste Klasse S'!U23","v":0}]
[{"$f":"IF('Liste Klasse S'!A24=\"\",\"\",'Liste Klasse S'!A24&\" / \"&'Liste Klasse S'!B24&\" / Klasse S\")","v":""},{"$f":"IF('Liste Klasse S'!C24=\"\",\"\",'Liste Klasse S'!C24)","v":""},{"$f":"IF('Liste Klasse S'!D24=\"\",\"\",'Liste Klasse S'!D24)","v":""},{"$f":"IF('Liste Klasse S'!E24=\"\",\"\",'Liste Klasse S'!E24)","v":""},{"$f":"IF('Liste Klasse S'!F24=\"\",\"\",'Liste Klasse S'!F24)","v":""},{"$f":"IF('Liste Klasse S'!G24=\"\",\"\",'Liste Klasse S'!G24)","v":""},{"$f":"IF('Liste Klasse S'!H24=\"\",\"\",'Liste Klasse S'!H24)","v":""},{"$f":"IF('Liste Klasse S'!I24=\"\",\"\",'Liste Klasse S'!I24)","v":""},{"$f":"IF('Liste Klasse S'!J24=\"\",\"\",'Liste Klasse S'!J24)","v":""},{"$f":"IF('Liste Klasse S'!K24=\"\",\"\",'Liste Klasse S'!K24)","v":""},{"$f":"IF('Liste Klasse S'!L24=\"\",\"\",'Liste Klasse S'!L24)","v":""},{"$f":"IF('Liste Klasse S'!M24=\"\",\"\",'Liste Klasse S'!M24)","v":""},{"$f":"IF('Liste Klasse S'!N24=\"\",\"\",'Liste Klasse S'!N24)","v":""},{"$f":"IF('Liste Klasse S'!O24=\"\",\"\",'Liste Klasse S'!O24)","v":""},{"$f":"IF('Liste Klasse S'!P24=\"\",\"\",'Liste Klasse S'!P24)","v":""},{"$f":"IF('Liste Klasse S'!Q24=\"\",\"\",'Liste Klasse S'!Q24)","v":""},{"$f":"IF('Liste Klasse S'!R24=\"\",\"\",'Liste Klasse S'!R24)","v":""},{"$f":"'Liste Klasse S'!S24","v":0},{"$f":"'Liste Klasse S'!T24","v":""},{"$f":"'Liste Klasse S'!U24","v":0}]
[{"$f":"IF('Liste Klasse S'!A25=\"\",\"\",'Liste Klasse S'!A25&\" / \"&'Liste Klasse S'!B25&\" / Klasse S\")","v":""},{"$f":"IF('Liste Klasse S'!C25=\"\",\"\",'Liste Klasse S'!C25)","v":""},{"$f":"IF('Liste Klasse S'!D25=\"\",\"\",'Liste Klasse S'!D25)","v":""},{"$f":"IF('Liste Klasse S'!E25=\"\",\"\",'Liste Klasse S'!E25)","v":""},{"$f":"IF('Liste Klasse S'!F25=\"\",\"\",'Liste Klasse S'!F25)","v":""},{"$f":"IF('Liste Klasse S'!G25=\"\",\"\",'Liste Klasse S'!G25)","v":""},{"$f":"IF('Liste Klasse S'!H25=\"\",\"\",'Liste Klasse S'!H25)","v":""},{"$f":"IF('Liste Klasse S'!I25=\"\",\"\",'Liste Klasse S'!I25)","v":""},{"$f":"IF('Liste Klasse S'!J25=\"\",\"\",'Liste Klasse S'!J25)","v":""},{"$f":"IF('Liste Klasse S'!K25=\"\",\"\",'Liste Klasse S'!K25)","v":""},{"$f":"IF('Liste Klasse S'!L25=\"\",\"\",'Liste Klasse S'!L25)","v":""},{"$f":"IF('Liste Klasse S'!M25=\"\",\"\",'Liste Klasse S'!M25)","v":""},{"$f":"IF('Liste Klasse S'!N25=\"\",\"\",'Liste Klasse S'!N25)","v":""},{"$f":"IF('Liste Klasse S'!O25=\"\",\"\",'Liste Klasse S'!O25)","v":""},{"$f":"IF('Liste Klasse S'!P25=\"\",\"\",'Liste Klasse S'!P25)","v":""},{"$f":"IF('Liste Klasse S'!Q25=\"\",\"\",'Liste Klasse S'!Q25)","v":""},{"$f":"IF('Liste Klasse S'!R25=\"\",\"\",'Liste Klasse S'!R25)","v":""},{"$f":"'Liste Klasse S'!S25","v":0},{"$f":"'Liste Klasse S'!T25","v":""},{"$f":"'Liste Klasse S'!U25","v":0}]